{"text_format":"2","workbook":"xlsx","n_sheets":3,"sheets":["Leave Tracker","Holidays","Sheet3"],"not_rendered":{"charts":0,"images":0,"macros":1,"external_links":0,"defined_names":31,"comments":0,"pivot_tables":0},"unopened":[],"bounds":{"document_bytes":16777216,"sheet_cells":100000,"run_cost":"one","rows_first":2000,"rows_last":500,"rows_between":2000,"halvings":0,"cell_chars":16384,"cell_head_chars":4096},"cells_cut":0,"cells_raw":0,"read":"whole","date_system":"1900"}

{"sheet":"Leave Tracker","index":0,"n_rows":20,"n_cols":383,"rows_kept":20,"cut":false,"hidden":false,"merged":[[4,378,5,378],[4,379,5,379],[4,373,5,373],[4,374,5,374],[4,375,5,375],[4,376,5,376],[4,377,5,377]]}
[1]
[2017,{"$nulls":380},"Sick Leave","S"]
[1,{"$f":"AND(NOT(ISNUMBER(MATCH(DATE($A$2,INT((COLUMN()-1)/31.001)+$A$1,ROUNDUP(MOD(COLUMN()-1,31.001),0)),HolidayList[Date],0))),(VLOOKUP(VLOOKUP(WEEKDAY(DATE($A$2,INT((COLUMN()-1)/31.001)+$A$1,ROUNDUP(MOD(COLUMN()-1,31.001),0)),2),Sheet3!$D$1:$E$7,2,0),$NR$11:$NS$17,2,0)=\"Yes\"))","v":false},{"$f":"AND(NOT(ISNUMBER(MATCH(DATE($A$2,INT((COLUMN()-1)/31.001)+$A$1,ROUNDUP(MOD(COLUMN()-1,31.001),0)),HolidayList[Date],0))),(VLOOKUP(VLOOKUP(WEEKDAY(DATE($A$2,INT((COLUMN()-1)/31.001)+$A$1,ROUNDUP(MOD(COLUMN()-1,31.001),0)),2),Sheet3!$D$1:$E$7,2,0),$NR$11:$NS$17,2,0)=\"Yes\"))","v":true},{"$f":"AND(NOT(ISNUMBER(MATCH(DATE($A$2,INT((COLUMN()-1)/31.001)+$A$1,ROUNDUP(MOD(COLUMN()-1,31.001),0)),HolidayList[Date],0))),(VLOOKUP(VLOOKUP(WEEKDAY(DATE($A$2,INT((COLUMN()-1)/31.001)+$A$1,ROUNDUP(MOD(COLUMN()-1,31.001),0)),2),Sheet3!$D$1:$E$7,2,0),$NR$11:$NS$17,2,0)=\"Yes\"))","v":true},{"$f":"AND(NOT(ISNUMBER(MATCH(DATE($A$2,INT((COLUMN()-1)/31.001)+$A$1,ROUNDUP(MOD(COLUMN()-1,31.001),0)),HolidayList[Date],0))),(VLOOKUP(VLOOKUP(WEEKDAY(DATE($A$2,INT((COLUMN()-1)/31.001)+$A$1,ROUNDUP(MOD(COLUMN()-1,31.001),0)),2),Sheet3!$D$1:$E$7,2,0),$NR$11:$NS$17,2,0)=\"Yes\"))","v":true},{"$f":"AND(NOT(ISNUMBER(MATCH(DATE($A$2,INT((COLUMN()-1)/31.001)+$A$1,ROUNDUP(MOD(COLUMN()-1,31.001),0)),HolidayList[Date],0))),(VLOOKUP(VLOOKUP(WEEKDAY(DATE($A$2,INT((COLUMN()-1)/31.001)+$A$1,ROUNDUP(MOD(COLUMN()-1,31.001),0)),2),Sheet3!$D$1:$E$7,2,0),$NR$11:$NS$17,2,0)=\"Yes\"))","v":true},{"$f":"AND(NOT(ISNUMBER(MATCH(DATE($A$2,INT((COLUMN()-1)/31.001)+$A$1,ROUNDUP(MOD(COLUMN()-1,31.001),0)),HolidayList[Date],0))),(VLOOKUP(VLOOKUP(WEEKDAY(DATE($A$2,INT((COLUMN()-1)/31.001)+$A$1,ROUNDUP(MOD(COLUMN()-1,31.001),0)),2),Sheet3!$D$1:$E$7,2,0),$NR$11:$NS$17,2,0)=\"Yes\"))","v":true},{"$f":"AND(NOT(ISNUMBER(MATCH(DATE($A$2,INT((COLUMN()-1)/31.001)+$A$1,ROUNDUP(MOD(COLUMN()-1,31.001),0)),HolidayList[Date],0))),(VLOOKUP(VLOOKUP(WEEKDAY(DATE($A$2,INT((COLUMN()-1)/31.001)+$A$1,ROUNDUP(MOD(COLUMN()-1,31.001),0)),2),Sheet3!$D$1:$E$7,2,0),$NR$11:$NS$17,2,0)=\"Yes\"))","v":false},{"$f":"AND(NOT(ISNUMBER(MATCH(DATE($A$2,INT((COLUMN()-1)/31.001)+$A$1,ROUNDUP(MOD(COLUMN()-1,31.001),0)),HolidayList[Date],0))),(VLOOKUP(VLOOKUP(WEEKDAY(DATE($A$2,INT((COLUMN()-1)/31.001)+$A$1,ROUNDUP(MOD(COLUMN()-1,31.001),0)),2),Sheet3!$D$1:$E$7,2,0),$NR$11:$NS$17,2,0)=\"Yes\"))","v":false},{"$f":"AND(NOT(ISNUMBER(MATCH(DATE($A$2,INT((COLUMN()-1)/31.001)+$A$1,ROUNDUP(MOD(COLUMN()-1,31.001),0)),HolidayList[Date],0))),(VLOOKUP(VLOOKUP(WEEKDAY(DATE($A$2,INT((COLUMN()-1)/31.001)+$A$1,ROUNDUP(MOD(COLUMN()-1,31.001),0)),2),Sheet3!$D$1:$E$7,2,0),$NR$11:$NS$17,2,0)=\"Yes\"))","v":true},{"$f":"AND(NOT(ISNUMBER(MATCH(DATE($A$2,INT((COLUMN()-1)/31.001)+$A$1,ROUNDUP(MOD(COLUMN()-1,31.001),0)),HolidayList[Date],0))),(VLOOKUP(VLOOKUP(WEEKDAY(DATE($A$2,INT((COLUMN()-1)/31.001)+$A$1,ROUNDUP(MOD(COLUMN()-1,31.001),0)),2),Sheet3!$D$1:$E$7,2,0),$NR$11:$NS$17,2,0)=\"Yes\"))","v":true},{"$f":"AND(NOT(ISNUMBER(MATCH(DATE($A$2,INT((COLUMN()-1)/31.001)+$A$1,ROUNDUP(MOD(COLUMN()-1,31.001),0)),HolidayList[Date],0))),(VLOOKUP(VLOOKUP(WEEKDAY(DATE($A$2,INT((COLUMN()-1)/31.001)+$A$1,ROUNDUP(MOD(COLUMN()-1,31.001),0)),2),Sheet3!$D$1:$E$7,2,0),$NR$11:$NS$17,2,0)=\"Yes\"))","v":true},{"$f":"AND(NOT(ISNUMBER(MATCH(DATE($A$2,INT((COLUMN()-1)/31.001)+$A$1,ROUNDUP(MOD(COLUMN()-1,31.001),0)),HolidayList[Date],0))),(VLOOKUP(VLOOKUP(WEEKDAY(DATE($A$2,INT((COLUMN()-1)/31.001)+$A$1,ROUNDUP(MOD(COLUMN()-1,31.001),0)),2),Sheet3!$D$1:$E$7,2,0),$NR$11:$NS$17,2,0)=\"Yes\"))","v":true},{"$f":"AND(NOT(ISNUMBER(MATCH(DATE($A$2,INT((COLUMN()-1)/31.001)+$A$1,ROUNDUP(MOD(COLUMN()-1,31.001),0)),HolidayList[Date],0))),(VLOOKUP(VLOOKUP(WEEKDAY(DATE($A$2,INT((COLUMN()-1)/31.001)+$A$1,ROUNDUP(MOD(COLUMN()-1,31.001),0)),2),Sheet3!$D$1:$E$7,2,0),$NR$11:$NS$17,2,0)=\"Yes\"))","v":true},{"$f":"AND(NOT(ISNUMBER(MATCH(DATE($A$2,INT((COLUMN()-1)/31.001)+$A$1,ROUNDUP(MOD(COLUMN()-1,31.001),0)),HolidayList[Date],0))),(VLOOKUP(VLOOKUP(WEEKDAY(DATE($A$2,INT((COLUMN()-1)/31.001)+$A$1,ROUNDUP(MOD(COLUMN()-1,31.001),0)),2),Sheet3!$D$1:$E$7,2,0),$NR$11:$NS$17,2,0)=\"Yes\"))","v":false},{"$f":"AND(NOT(ISNUMBER(MATCH(DATE($A$2,INT((COLUMN()-1)/31.001)+$A$1,ROUNDUP(MOD(COLUMN()-1,31.001),0)),HolidayList[Date],0))),(VLOOKUP(VLOOKUP(WEEKDAY(DATE($A$2,INT((COLUMN()-1)/31.001)+$A$1,ROUNDUP(MOD(COLUMN()-1,31.001),0)),2),Sheet3!$D$1:$E$7,2,0),$NR$11:$NS$17,2,0)=\"Yes\"))","v":false},{"$f":"AND(NOT(ISNUMBER(MATCH(DATE($A$2,INT((COLUMN()-1)/31.001)+$A$1,ROUNDUP(MOD(COLUMN()-1,31.001),0)),HolidayList[Date],0))),(VLOOKUP(VLOOKUP(WEEKDAY(DATE($A$2,INT((COLUMN()-1)/31.001)+$A$1,ROUNDUP(MOD(COLUMN()-1,31.001),0)),2),Sheet3!$D$1:$E$7,2,0),$NR$11:$NS$17,2,0)=\"Yes\"))","v":false},{"$f":"AND(NOT(ISNUMBER(MATCH(DATE($A$2,INT((COLUMN()-1)/31.001)+$A$1,ROUNDUP(MOD(COLUMN()-1,31.001),0)),HolidayList[Date],0))),(VLOOKUP(VLOOKUP(WEEKDAY(DATE($A$2,INT((COLUMN()-1)/31.001)+$A$1,ROUNDUP(MOD(COLUMN()-1,31.001),0)),2),Sheet3!$D$1:$E$7,2,0),$NR$11:$NS$17,2,0)=\"Yes\"))","v":true},{"$f":"AND(NOT(ISNUMBER(MATCH(DATE($A$2,INT((COLUMN()-1)/31.001)+$A$1,ROUNDUP(MOD(COLUMN()-1,31.001),0)),HolidayList[Date],0))),(VLOOKUP(VLOOKUP(WEEKDAY(DATE($A$2,INT((COLUMN()-1)/31.001)+$A$1,ROUNDUP(MOD(COLUMN()-1,31.001),0)),2),Sheet3!$D$1:$E$7,2,0),$NR$11:$NS$17,2,0)=\"Yes\"))","v":true},{"$f":"AND(NOT(ISNUMBER(MATCH(DATE($A$2,INT((COLUMN()-1)/31.001)+$A$1,ROUNDUP(MOD(COLUMN()-1,31.001),0)),HolidayList[Date],0))),(VLOOKUP(VLOOKUP(WEEKDAY(DATE($A$2,INT((COLUMN()-1)/31.001)+$A$1,ROUNDUP(MOD(COLUMN()-1,31.001),0)),2),Sheet3!$D$1:$E$7,2,0),$NR$11:$NS$17,2,0)=\"Yes\"))","v":true},{"$f":"AND(NOT(ISNUMBER(MATCH(DATE($A$2,INT((COLUMN()-1)/31.001)+$A$1,ROUNDUP(MOD(COLUMN()-1,31.001),0)),HolidayList[Date],0))),(VLOOKUP(VLOOKUP(WEEKDAY(DATE($A$2,INT((COLUMN()-1)/31.001)+$A$1,ROUNDUP(MOD(COLUMN()-1,31.001),0)),2),Sheet3!$D$1:$E$7,2,0),$NR$11:$NS$17,2,0)=\"Yes\"))","v":true},{"$f":"AND(NOT(ISNUMBER(MATCH(DATE($A$2,INT((COLUMN()-1)/31.001)+$A$1,ROUNDUP(MOD(COLUMN()-1,31.001),0)),HolidayList[Date],0))),(VLOOKUP(VLOOKUP(WEEKDAY(DATE($A$2,INT((COLUMN()-1)/31.001)+$A$1,ROUNDUP(MOD(COLUMN()-1,31.001),0)),2),Sheet3!$D$1:$E$7,2,0),$NR$11:$NS$17,2,0)=\"Yes\"))","v":false},{"$f":"AND(NOT(ISNUMBER(MATCH(DATE($A$2,INT((COLUMN()-1)/31.001)+$A$1,ROUNDUP(MOD(COLUMN()-1,31.001),0)),HolidayList[Date],0))),(VLOOKUP(VLOOKUP(WEEKDAY(DATE($A$2,INT((COLUMN()-1)/31.001)+$A$1,ROUNDUP(MOD(COLUMN()-1,31.001),0)),2),Sheet3!$D$1:$E$7,2,0),$NR$11:$NS$17,2,0)=\"Yes\"))","v":false},{"$f":"AND(NOT(ISNUMBER(MATCH(DATE($A$2,INT((COLUMN()-1)/31.001)+$A$1,ROUNDUP(MOD(COLUMN()-1,31.001),0)),HolidayList[Date],0))),(VLOOKUP(VLOOKUP(WEEKDAY(DATE($A$2,INT((COLUMN()-1)/31.001)+$A$1,ROUNDUP(MOD(COLUMN()-1,31.001),0)),2),Sheet3!$D$1:$E$7,2,0),$NR$11:$NS$17,2,0)=\"Yes\"))","v":true},{"$f":"AND(NOT(ISNUMBER(MATCH(DATE($A$2,INT((COLUMN()-1)/31.001)+$A$1,ROUNDUP(MOD(COLUMN()-1,31.001),0)),HolidayList[Date],0))),(VLOOKUP(VLOOKUP(WEEKDAY(DATE($A$2,INT((COLUMN()-1)/31.001)+$A$1,ROUNDUP(MOD(COLUMN()-1,31.001),0)),2),Sheet3!$D$1:$E$7,2,0),$NR$11:$NS$17,2,0)=\"Yes\"))","v":true},{"$f":"AND(NOT(ISNUMBER(MATCH(DATE($A$2,INT((COLUMN()-1)/31.001)+$A$1,ROUNDUP(MOD(COLUMN()-1,31.001),0)),HolidayList[Date],0))),(VLOOKUP(VLOOKUP(WEEKDAY(DATE($A$2,INT((COLUMN()-1)/31.001)+$A$1,ROUNDUP(MOD(COLUMN()-1,31.001),0)),2),Sheet3!$D$1:$E$7,2,0),$NR$11:$NS$17,2,0)=\"Yes\"))","v":true},{"$f":"AND(NOT(ISNUMBER(MATCH(DATE($A$2,INT((COLUMN()-1)/31.001)+$A$1,ROUNDUP(MOD(COLUMN()-1,31.001),0)),HolidayList[Date],0))),(VLOOKUP(VLOOKUP(WEEKDAY(DATE($A$2,INT((COLUMN()-1)/31.001)+$A$1,ROUNDUP(MOD(COLUMN()-1,31.001),0)),2),Sheet3!$D$1:$E$7,2,0),$NR$11:$NS$17,2,0)=\"Yes\"))","v":true},{"$f":"AND(NOT(ISNUMBER(MATCH(DATE($A$2,INT((COLUMN()-1)/31.001)+$A$1,ROUNDUP(MOD(COLUMN()-1,31.001),0)),HolidayList[Date],0))),(VLOOKUP(VLOOKUP(WEEKDAY(DATE($A$2,INT((COLUMN()-1)/31.001)+$A$1,ROUNDUP(MOD(COLUMN()-1,31.001),0)),2),Sheet3!$D$1:$E$7,2,0),$NR$11:$NS$17,2,0)=\"Yes\"))","v":true},{"$f":"AND(NOT(ISNUMBER(MATCH(DATE($A$2,INT((COLUMN()-1)/31.001)+$A$1,ROUNDUP(MOD(COLUMN()-1,31.001),0)),HolidayList[Date],0))),(VLOOKUP(VLOOKUP(WEEKDAY(DATE($A$2,INT((COLUMN()-1)/31.001)+$A$1,ROUNDUP(MOD(COLUMN()-1,31.001),0)),2),Sheet3!$D$1:$E$7,2,0),$NR$11:$NS$17,2,0)=\"Yes\"))","v":false},{"$f":"AND(NOT(ISNUMBER(MATCH(DATE($A$2,INT((COLUMN()-1)/31.001)+$A$1,ROUNDUP(MOD(COLUMN()-1,31.001),0)),HolidayList[Date],0))),(VLOOKUP(VLOOKUP(WEEKDAY(DATE($A$2,INT((COLUMN()-1)/31.001)+$A$1,ROUNDUP(MOD(COLUMN()-1,31.001),0)),2),Sheet3!$D$1:$E$7,2,0),$NR$11:$NS$17,2,0)=\"Yes\"))","v":false},{"$f":"AND(NOT(ISNUMBER(MATCH(DATE($A$2,INT((COLUMN()-1)/31.001)+$A$1,ROUNDUP(MOD(COLUMN()-1,31.001),0)),HolidayList[Date],0))),(VLOOKUP(VLOOKUP(WEEKDAY(DATE($A$2,INT((COLUMN()-1)/31.001)+$A$1,ROUNDUP(MOD(COLUMN()-1,31.001),0)),2),Sheet3!$D$1:$E$7,2,0),$NR$11:$NS$17,2,0)=\"Yes\"))","v":true},{"$f":"AND(NOT(ISNUMBER(MATCH(DATE($A$2,INT((COLUMN()-1)/31.001)+$A$1,ROUNDUP(MOD(COLUMN()-1,31.001),0)),HolidayList[Date],0))),(VLOOKUP(VLOOKUP(WEEKDAY(DATE($A$2,INT((COLUMN()-1)/31.001)+$A$1,ROUNDUP(MOD(COLUMN()-1,31.001),0)),2),Sheet3!$D$1:$E$7,2,0),$NR$11:$NS$17,2,0)=\"Yes\"))","v":true},{"$f":"AND(NOT(ISNUMBER(MATCH(DATE($A$2,INT((COLUMN()-1)/31.001)+$A$1,ROUNDUP(MOD(COLUMN()-1,31.001),0)),HolidayList[Date],0))),(VLOOKUP(VLOOKUP(WEEKDAY(DATE($A$2,INT((COLUMN()-1)/31.001)+$A$1,ROUNDUP(MOD(COLUMN()-1,31.001),0)),2),Sheet3!$D$1:$E$7,2,0),$NR$11:$NS$17,2,0)=\"Yes\"))","v":true},{"$f":"AND(NOT(ISNUMBER(MATCH(DATE($A$2,INT((COLUMN()-1)/31.001)+$A$1,ROUNDUP(MOD(COLUMN()-1,31.001),0)),HolidayList[Date],0))),(VLOOKUP(VLOOKUP(WEEKDAY(DATE($A$2,INT((COLUMN()-1)/31.001)+$A$1,ROUNDUP(MOD(COLUMN()-1,31.001),0)),2),Sheet3!$D$1:$E$7,2,0),$NR$11:$NS$17,2,0)=\"Yes\"))","v":true},{"$f":"AND(NOT(ISNUMBER(MATCH(DATE($A$2,INT((COLUMN()-1)/31.001)+$A$1,ROUNDUP(MOD(COLUMN()-1,31.001),0)),HolidayList[Date],0))),(VLOOKUP(VLOOKUP(WEEKDAY(DATE($A$2,INT((COLUMN()-1)/31.001)+$A$1,ROUNDUP(MOD(COLUMN()-1,31.001),0)),2),Sheet3!$D$1:$E$7,2,0),$NR$11:$NS$17,2,0)=\"Yes\"))","v":true},{"$f":"AND(NOT(ISNUMBER(MATCH(DATE($A$2,INT((COLUMN()-1)/31.001)+$A$1,ROUNDUP(MOD(COLUMN()-1,31.001),0)),HolidayList[Date],0))),(VLOOKUP(VLOOKUP(WEEKDAY(DATE($A$2,INT((COLUMN()-1)/31.001)+$A$1,ROUNDUP(MOD(COLUMN()-1,31.001),0)),2),Sheet3!$D$1:$E$7,2,0),$NR$11:$NS$17,2,0)=\"Yes\"))","v":false},{"$f":"AND(NOT(ISNUMBER(MATCH(DATE($A$2,INT((COLUMN()-1)/31.001)+$A$1,ROUNDUP(MOD(COLUMN()-1,31.001),0)),HolidayList[Date],0))),(VLOOKUP(VLOOKUP(WEEKDAY(DATE($A$2,INT((COLUMN()-1)/31.001)+$A$1,ROUNDUP(MOD(COLUMN()-1,31.001),0)),2),Sheet3!$D$1:$E$7,2,0),$NR$11:$NS$17,2,0)=\"Yes\"))","v":false},{"$f":"AND(NOT(ISNUMBER(MATCH(DATE($A$2,INT((COLUMN()-1)/31.001)+$A$1,ROUNDUP(MOD(COLUMN()-1,31.001),0)),HolidayList[Date],0))),(VLOOKUP(VLOOKUP(WEEKDAY(DATE($A$2,INT((COLUMN()-1)/31.001)+$A$1,ROUNDUP(MOD(COLUMN()-1,31.001),0)),2),Sheet3!$D$1:$E$7,2,0),$NR$11:$NS$17,2,0)=\"Yes\"))","v":true},{"$f":"AND(NOT(ISNUMBER(MATCH(DATE($A$2,INT((COLUMN()-1)/31.001)+$A$1,ROUNDUP(MOD(COLUMN()-1,31.001),0)),HolidayList[Date],0))),(VLOOKUP(VLOOKUP(WEEKDAY(DATE($A$2,INT((COLUMN()-1)/31.001)+$A$1,ROUNDUP(MOD(COLUMN()-1,31.001),0)),2),Sheet3!$D$1:$E$7,2,0),$NR$11:$NS$17,2,0)=\"Yes\"))","v":true},{"$f":"AND(NOT(ISNUMBER(MATCH(DATE($A$2,INT((COLUMN()-1)/31.001)+$A$1,ROUNDUP(MOD(COLUMN()-1,31.001),0)),HolidayList[Date],0))),(VLOOKUP(VLOOKUP(WEEKDAY(DATE($A$2,INT((COLUMN()-1)/31.001)+$A$1,ROUNDUP(MOD(COLUMN()-1,31.001),0)),2),Sheet3!$D$1:$E$7,2,0),$NR$11:$NS$17,2,0)=\"Yes\"))","v":true},{"$f":"AND(NOT(ISNUMBER(MATCH(DATE($A$2,INT((COLUMN()-1)/31.001)+$A$1,ROUNDUP(MOD(COLUMN()-1,31.001),0)),HolidayList[Date],0))),(VLOOKUP(VLOOKUP(WEEKDAY(DATE($A$2,INT((COLUMN()-1)/31.001)+$A$1,ROUNDUP(MOD(COLUMN()-1,31.001),0)),2),Sheet3!$D$1:$E$7,2,0),$NR$11:$NS$17,2,0)=\"Yes\"))","v":true},{"$f":"AND(NOT(ISNUMBER(MATCH(DATE($A$2,INT((COLUMN()-1)/31.001)+$A$1,ROUNDUP(MOD(COLUMN()-1,31.001),0)),HolidayList[Date],0))),(VLOOKUP(VLOOKUP(WEEKDAY(DATE($A$2,INT((COLUMN()-1)/31.001)+$A$1,ROUNDUP(MOD(COLUMN()-1,31.001),0)),2),Sheet3!$D$1:$E$7,2,0),$NR$11:$NS$17,2,0)=\"Yes\"))","v":true},{"$f":"AND(NOT(ISNUMBER(MATCH(DATE($A$2,INT((COLUMN()-1)/31.001)+$A$1,ROUNDUP(MOD(COLUMN()-1,31.001),0)),HolidayList[Date],0))),(VLOOKUP(VLOOKUP(WEEKDAY(DATE($A$2,INT((COLUMN()-1)/31.001)+$A$1,ROUNDUP(MOD(COLUMN()-1,31.001),0)),2),Sheet3!$D$1:$E$7,2,0),$NR$11:$NS$17,2,0)=\"Yes\"))","v":false},{"$f":"AND(NOT(ISNUMBER(MATCH(DATE($A$2,INT((COLUMN()-1)/31.001)+$A$1,ROUNDUP(MOD(COLUMN()-1,31.001),0)),HolidayList[Date],0))),(VLOOKUP(VLOOKUP(WEEKDAY(DATE($A$2,INT((COLUMN()-1)/31.001)+$A$1,ROUNDUP(MOD(COLUMN()-1,31.001),0)),2),Sheet3!$D$1:$E$7,2,0),$NR$11:$NS$17,2,0)=\"Yes\"))","v":false},{"$f":"AND(NOT(ISNUMBER(MATCH(DATE($A$2,INT((COLUMN()-1)/31.001)+$A$1,ROUNDUP(MOD(COLUMN()-1,31.001),0)),HolidayList[Date],0))),(VLOOKUP(VLOOKUP(WEEKDAY(DATE($A$2,INT((COLUMN()-1)/31.001)+$A$1,ROUNDUP(MOD(COLUMN()-1,31.001),0)),2),Sheet3!$D$1:$E$7,2,0),$NR$11:$NS$17,2,0)=\"Yes\"))","v":true},{"$f":"AND(NOT(ISNUMBER(MATCH(DATE($A$2,INT((COLUMN()-1)/31.001)+$A$1,ROUNDUP(MOD(COLUMN()-1,31.001),0)),HolidayList[Date],0))),(VLOOKUP(VLOOKUP(WEEKDAY(DATE($A$2,INT((COLUMN()-1)/31.001)+$A$1,ROUNDUP(MOD(COLUMN()-1,31.001),0)),2),Sheet3!$D$1:$E$7,2,0),$NR$11:$NS$17,2,0)=\"Yes\"))","v":true},{"$f":"AND(NOT(ISNUMBER(MATCH(DATE($A$2,INT((COLUMN()-1)/31.001)+$A$1,ROUNDUP(MOD(COLUMN()-1,31.001),0)),HolidayList[Date],0))),(VLOOKUP(VLOOKUP(WEEKDAY(DATE($A$2,INT((COLUMN()-1)/31.001)+$A$1,ROUNDUP(MOD(COLUMN()-1,31.001),0)),2),Sheet3!$D$1:$E$7,2,0),$NR$11:$NS$17,2,0)=\"Yes\"))","v":true},{"$f":"AND(NOT(ISNUMBER(MATCH(DATE($A$2,INT((COLUMN()-1)/31.001)+$A$1,ROUNDUP(MOD(COLUMN()-1,31.001),0)),HolidayList[Date],0))),(VLOOKUP(VLOOKUP(WEEKDAY(DATE($A$2,INT((COLUMN()-1)/31.001)+$A$1,ROUNDUP(MOD(COLUMN()-1,31.001),0)),2),Sheet3!$D$1:$E$7,2,0),$NR$11:$NS$17,2,0)=\"Yes\"))","v":true},{"$f":"AND(NOT(ISNUMBER(MATCH(DATE($A$2,INT((COLUMN()-1)/31.001)+$A$1,ROUNDUP(MOD(COLUMN()-1,31.001),0)),HolidayList[Date],0))),(VLOOKUP(VLOOKUP(WEEKDAY(DATE($A$2,INT((COLUMN()-1)/31.001)+$A$1,ROUNDUP(MOD(COLUMN()-1,31.001),0)),2),Sheet3!$D$1:$E$7,2,0),$NR$11:$NS$17,2,0)=\"Yes\"))","v":true},{"$f":"AND(NOT(ISNUMBER(MATCH(DATE($A$2,INT((COLUMN()-1)/31.001)+$A$1,ROUNDUP(MOD(COLUMN()-1,31.001),0)),HolidayList[Date],0))),(VLOOKUP(VLOOKUP(WEEKDAY(DATE($A$2,INT((COLUMN()-1)/31.001)+$A$1,ROUNDUP(MOD(COLUMN()-1,31.001),0)),2),Sheet3!$D$1:$E$7,2,0),$NR$11:$NS$17,2,0)=\"Yes\"))","v":false},{"$f":"AND(NOT(ISNUMBER(MATCH(DATE($A$2,INT((COLUMN()-1)/31.001)+$A$1,ROUNDUP(MOD(COLUMN()-1,31.001),0)),HolidayList[Date],0))),(VLOOKUP(VLOOKUP(WEEKDAY(DATE($A$2,INT((COLUMN()-1)/31.001)+$A$1,ROUNDUP(MOD(COLUMN()-1,31.001),0)),2),Sheet3!$D$1:$E$7,2,0),$NR$11:$NS$17,2,0)=\"Yes\"))","v":false},{"$f":"AND(NOT(ISNUMBER(MATCH(DATE($A$2,INT((COLUMN()-1)/31.001)+$A$1,ROUNDUP(MOD(COLUMN()-1,31.001),0)),HolidayList[Date],0))),(VLOOKUP(VLOOKUP(WEEKDAY(DATE($A$2,INT((COLUMN()-1)/31.001)+$A$1,ROUNDUP(MOD(COLUMN()-1,31.001),0)),2),Sheet3!$D$1:$E$7,2,0),$NR$11:$NS$17,2,0)=\"Yes\"))","v":false},{"$f":"AND(NOT(ISNUMBER(MATCH(DATE($A$2,INT((COLUMN()-1)/31.001)+$A$1,ROUNDUP(MOD(COLUMN()-1,31.001),0)),HolidayList[Date],0))),(VLOOKUP(VLOOKUP(WEEKDAY(DATE($A$2,INT((COLUMN()-1)/31.001)+$A$1,ROUNDUP(MOD(COLUMN()-1,31.001),0)),2),Sheet3!$D$1:$E$7,2,0),$NR$11:$NS$17,2,0)=\"Yes\"))","v":true},{"$f":"AND(NOT(ISNUMBER(MATCH(DATE($A$2,INT((COLUMN()-1)/31.001)+$A$1,ROUNDUP(MOD(COLUMN()-1,31.001),0)),HolidayList[Date],0))),(VLOOKUP(VLOOKUP(WEEKDAY(DATE($A$2,INT((COLUMN()-1)/31.001)+$A$1,ROUNDUP(MOD(COLUMN()-1,31.001),0)),2),Sheet3!$D$1:$E$7,2,0),$NR$11:$NS$17,2,0)=\"Yes\"))","v":true},{"$f":"AND(NOT(ISNUMBER(MATCH(DATE($A$2,INT((COLUMN()-1)/31.001)+$A$1,ROUNDUP(MOD(COLUMN()-1,31.001),0)),HolidayList[Date],0))),(VLOOKUP(VLOOKUP(WEEKDAY(DATE($A$2,INT((COLUMN()-1)/31.001)+$A$1,ROUNDUP(MOD(COLUMN()-1,31.001),0)),2),Sheet3!$D$1:$E$7,2,0),$NR$11:$NS$17,2,0)=\"Yes\"))","v":true},{"$f":"AND(NOT(ISNUMBER(MATCH(DATE($A$2,INT((COLUMN()-1)/31.001)+$A$1,ROUNDUP(MOD(COLUMN()-1,31.001),0)),HolidayList[Date],0))),(VLOOKUP(VLOOKUP(WEEKDAY(DATE($A$2,INT((COLUMN()-1)/31.001)+$A$1,ROUNDUP(MOD(COLUMN()-1,31.001),0)),2),Sheet3!$D$1:$E$7,2,0),$NR$11:$NS$17,2,0)=\"Yes\"))","v":true},{"$f":"AND(NOT(ISNUMBER(MATCH(DATE($A$2,INT((COLUMN()-1)/31.001)+$A$1,ROUNDUP(MOD(COLUMN()-1,31.001),0)),HolidayList[Date],0))),(VLOOKUP(VLOOKUP(WEEKDAY(DATE($A$2,INT((COLUMN()-1)/31.001)+$A$1,ROUNDUP(MOD(COLUMN()-1,31.001),0)),2),Sheet3!$D$1:$E$7,2,0),$NR$11:$NS$17,2,0)=\"Yes\"))","v":false},{"$f":"AND(NOT(ISNUMBER(MATCH(DATE($A$2,INT((COLUMN()-1)/31.001)+$A$1,ROUNDUP(MOD(COLUMN()-1,31.001),0)),HolidayList[Date],0))),(VLOOKUP(VLOOKUP(WEEKDAY(DATE($A$2,INT((COLUMN()-1)/31.001)+$A$1,ROUNDUP(MOD(COLUMN()-1,31.001),0)),2),Sheet3!$D$1:$E$7,2,0),$NR$11:$NS$17,2,0)=\"Yes\"))","v":false},{"$f":"AND(NOT(ISNUMBER(MATCH(DATE($A$2,INT((COLUMN()-1)/31.001)+$A$1,ROUNDUP(MOD(COLUMN()-1,31.001),0)),HolidayList[Date],0))),(VLOOKUP(VLOOKUP(WEEKDAY(DATE($A$2,INT((COLUMN()-1)/31.001)+$A$1,ROUNDUP(MOD(COLUMN()-1,31.001),0)),2),Sheet3!$D$1:$E$7,2,0),$NR$11:$NS$17,2,0)=\"Yes\"))","v":true},{"$f":"AND(NOT(ISNUMBER(MATCH(DATE($A$2,INT((COLUMN()-1)/31.001)+$A$1,ROUNDUP(MOD(COLUMN()-1,31.001),0)),HolidayList[Date],0))),(VLOOKUP(VLOOKUP(WEEKDAY(DATE($A$2,INT((COLUMN()-1)/31.001)+$A$1,ROUNDUP(MOD(COLUMN()-1,31.001),0)),2),Sheet3!$D$1:$E$7,2,0),$NR$11:$NS$17,2,0)=\"Yes\"))","v":true},{"$f":"AND(NOT(ISNUMBER(MATCH(DATE($A$2,INT((COLUMN()-1)/31.001)+$A$1,ROUNDUP(MOD(COLUMN()-1,31.001),0)),HolidayList[Date],0))),(VLOOKUP(VLOOKUP(WEEKDAY(DATE($A$2,INT((COLUMN()-1)/31.001)+$A$1,ROUNDUP(MOD(COLUMN()-1,31.001),0)),2),Sheet3!$D$1:$E$7,2,0),$NR$11:$NS$17,2,0)=\"Yes\"))","v":true},{"$f":"AND(NOT(ISNUMBER(MATCH(DATE($A$2,INT((COLUMN()-1)/31.001)+$A$1,ROUNDUP(MOD(COLUMN()-1,31.001),0)),HolidayList[Date],0))),(VLOOKUP(VLOOKUP(WEEKDAY(DATE($A$2,INT((COLUMN()-1)/31.001)+$A$1,ROUNDUP(MOD(COLUMN()-1,31.001),0)),2),Sheet3!$D$1:$E$7,2,0),$NR$11:$NS$17,2,0)=\"Yes\"))","v":true},{"$f":"AND(NOT(ISNUMBER(MATCH(DATE($A$2,INT((COLUMN()-1)/31.001)+$A$1,ROUNDUP(MOD(COLUMN()-1,31.001),0)),HolidayList[Date],0))),(VLOOKUP(VLOOKUP(WEEKDAY(DATE($A$2,INT((COLUMN()-1)/31.001)+$A$1,ROUNDUP(MOD(COLUMN()-1,31.001),0)),2),Sheet3!$D$1:$E$7,2,0),$NR$11:$NS$17,2,0)=\"Yes\"))","v":true},{"$f":"AND(NOT(ISNUMBER(MATCH(DATE($A$2,INT((COLUMN()-1)/31.001)+$A$1,ROUNDUP(MOD(COLUMN()-1,31.001),0)),HolidayList[Date],0))),(VLOOKUP(VLOOKUP(WEEKDAY(DATE($A$2,INT((COLUMN()-1)/31.001)+$A$1,ROUNDUP(MOD(COLUMN()-1,31.001),0)),2),Sheet3!$D$1:$E$7,2,0),$NR$11:$NS$17,2,0)=\"Yes\"))","v":true},{"$f":"AND(NOT(ISNUMBER(MATCH(DATE($A$2,INT((COLUMN()-1)/31.001)+$A$1,ROUNDUP(MOD(COLUMN()-1,31.001),0)),HolidayList[Date],0))),(VLOOKUP(VLOOKUP(WEEKDAY(DATE($A$2,INT((COLUMN()-1)/31.001)+$A$1,ROUNDUP(MOD(COLUMN()-1,31.001),0)),2),Sheet3!$D$1:$E$7,2,0),$NR$11:$NS$17,2,0)=\"Yes\"))","v":true},{"$f":"AND(NOT(ISNUMBER(MATCH(DATE($A$2,INT((COLUMN()-1)/31.001)+$A$1,ROUNDUP(MOD(COLUMN()-1,31.001),0)),HolidayList[Date],0))),(VLOOKUP(VLOOKUP(WEEKDAY(DATE($A$2,INT((COLUMN()-1)/31.001)+$A$1,ROUNDUP(MOD(COLUMN()-1,31.001),0)),2),Sheet3!$D$1:$E$7,2,0),$NR$11:$NS$17,2,0)=\"Yes\"))","v":true},{"$f":"AND(NOT(ISNUMBER(MATCH(DATE($A$2,INT((COLUMN()-1)/31.001)+$A$1,ROUNDUP(MOD(COLUMN()-1,31.001),0)),HolidayList[Date],0))),(VLOOKUP(VLOOKUP(WEEKDAY(DATE($A$2,INT((COLUMN()-1)/31.001)+$A$1,ROUNDUP(MOD(COLUMN()-1,31.001),0)),2),Sheet3!$D$1:$E$7,2,0),$NR$11:$NS$17,2,0)=\"Yes\"))","v":false},{"$f":"AND(NOT(ISNUMBER(MATCH(DATE($A$2,INT((COLUMN()-1)/31.001)+$A$1,ROUNDUP(MOD(COLUMN()-1,31.001),0)),HolidayList[Date],0))),(VLOOKUP(VLOOKUP(WEEKDAY(DATE($A$2,INT((COLUMN()-1)/31.001)+$A$1,ROUNDUP(MOD(COLUMN()-1,31.001),0)),2),Sheet3!$D$1:$E$7,2,0),$NR$11:$NS$17,2,0)=\"Yes\"))","v":false},{"$f":"AND(NOT(ISNUMBER(MATCH(DATE($A$2,INT((COLUMN()-1)/31.001)+$A$1,ROUNDUP(MOD(COLUMN()-1,31.001),0)),HolidayList[Date],0))),(VLOOKUP(VLOOKUP(WEEKDAY(DATE($A$2,INT((COLUMN()-1)/31.001)+$A$1,ROUNDUP(MOD(COLUMN()-1,31.001),0)),2),Sheet3!$D$1:$E$7,2,0),$NR$11:$NS$17,2,0)=\"Yes\"))","v":true},{"$f":"AND(NOT(ISNUMBER(MATCH(DATE($A$2,INT((COLUMN()-1)/31.001)+$A$1,ROUNDUP(MOD(COLUMN()-1,31.001),0)),HolidayList[Date],0))),(VLOOKUP(VLOOKUP(WEEKDAY(DATE($A$2,INT((COLUMN()-1)/31.001)+$A$1,ROUNDUP(MOD(COLUMN()-1,31.001),0)),2),Sheet3!$D$1:$E$7,2,0),$NR$11:$NS$17,2,0)=\"Yes\"))","v":true},{"$f":"AND(NOT(ISNUMBER(MATCH(DATE($A$2,INT((COLUMN()-1)/31.001)+$A$1,ROUNDUP(MOD(COLUMN()-1,31.001),0)),HolidayList[Date],0))),(VLOOKUP(VLOOKUP(WEEKDAY(DATE($A$2,INT((COLUMN()-1)/31.001)+$A$1,ROUNDUP(MOD(COLUMN()-1,31.001),0)),2),Sheet3!$D$1:$E$7,2,0),$NR$11:$NS$17,2,0)=\"Yes\"))","v":true},{"$f":"AND(NOT(ISNUMBER(MATCH(DATE($A$2,INT((COLUMN()-1)/31.001)+$A$1,ROUNDUP(MOD(COLUMN()-1,31.001),0)),HolidayList[Date],0))),(VLOOKUP(VLOOKUP(WEEKDAY(DATE($A$2,INT((COLUMN()-1)/31.001)+$A$1,ROUNDUP(MOD(COLUMN()-1,31.001),0)),2),Sheet3!$D$1:$E$7,2,0),$NR$11:$NS$17,2,0)=\"Yes\"))","v":true},{"$f":"AND(NOT(ISNUMBER(MATCH(DATE($A$2,INT((COLUMN()-1)/31.001)+$A$1,ROUNDUP(MOD(COLUMN()-1,31.001),0)),HolidayList[Date],0))),(VLOOKUP(VLOOKUP(WEEKDAY(DATE($A$2,INT((COLUMN()-1)/31.001)+$A$1,ROUNDUP(MOD(COLUMN()-1,31.001),0)),2),Sheet3!$D$1:$E$7,2,0),$NR$11:$NS$17,2,0)=\"Yes\"))","v":true},{"$f":"AND(NOT(ISNUMBER(MATCH(DATE($A$2,INT((COLUMN()-1)/31.001)+$A$1,ROUNDUP(MOD(COLUMN()-1,31.001),0)),HolidayList[Date],0))),(VLOOKUP(VLOOKUP(WEEKDAY(DATE($A$2,INT((COLUMN()-1)/31.001)+$A$1,ROUNDUP(MOD(COLUMN()-1,31.001),0)),2),Sheet3!$D$1:$E$7,2,0),$NR$11:$NS$17,2,0)=\"Yes\"))","v":false},{"$f":"AND(NOT(ISNUMBER(MATCH(DATE($A$2,INT((COLUMN()-1)/31.001)+$A$1,ROUNDUP(MOD(COLUMN()-1,31.001),0)),HolidayList[Date],0))),(VLOOKUP(VLOOKUP(WEEKDAY(DATE($A$2,INT((COLUMN()-1)/31.001)+$A$1,ROUNDUP(MOD(COLUMN()-1,31.001),0)),2),Sheet3!$D$1:$E$7,2,0),$NR$11:$NS$17,2,0)=\"Yes\"))","v":false},{"$f":"AND(NOT(ISNUMBER(MATCH(DATE($A$2,INT((COLUMN()-1)/31.001)+$A$1,ROUNDUP(MOD(COLUMN()-1,31.001),0)),HolidayList[Date],0))),(VLOOKUP(VLOOKUP(WEEKDAY(DATE($A$2,INT((COLUMN()-1)/31.001)+$A$1,ROUNDUP(MOD(COLUMN()-1,31.001),0)),2),Sheet3!$D$1:$E$7,2,0),$NR$11:$NS$17,2,0)=\"Yes\"))","v":true},{"$f":"AND(NOT(ISNUMBER(MATCH(DATE($A$2,INT((COLUMN()-1)/31.001)+$A$1,ROUNDUP(MOD(COLUMN()-1,31.001),0)),HolidayList[Date],0))),(VLOOKUP(VLOOKUP(WEEKDAY(DATE($A$2,INT((COLUMN()-1)/31.001)+$A$1,ROUNDUP(MOD(COLUMN()-1,31.001),0)),2),Sheet3!$D$1:$E$7,2,0),$NR$11:$NS$17,2,0)=\"Yes\"))","v":true},{"$f":"AND(NOT(ISNUMBER(MATCH(DATE($A$2,INT((COLUMN()-1)/31.001)+$A$1,ROUNDUP(MOD(COLUMN()-1,31.001),0)),HolidayList[Date],0))),(VLOOKUP(VLOOKUP(WEEKDAY(DATE($A$2,INT((COLUMN()-1)/31.001)+$A$1,ROUNDUP(MOD(COLUMN()-1,31.001),0)),2),Sheet3!$D$1:$E$7,2,0),$NR$11:$NS$17,2,0)=\"Yes\"))","v":true},{"$f":"AND(NOT(ISNUMBER(MATCH(DATE($A$2,INT((COLUMN()-1)/31.001)+$A$1,ROUNDUP(MOD(COLUMN()-1,31.001),0)),HolidayList[Date],0))),(VLOOKUP(VLOOKUP(WEEKDAY(DATE($A$2,INT((COLUMN()-1)/31.001)+$A$1,ROUNDUP(MOD(COLUMN()-1,31.001),0)),2),Sheet3!$D$1:$E$7,2,0),$NR$11:$NS$17,2,0)=\"Yes\"))","v":true},{"$f":"AND(NOT(ISNUMBER(MATCH(DATE($A$2,INT((COLUMN()-1)/31.001)+$A$1,ROUNDUP(MOD(COLUMN()-1,31.001),0)),HolidayList[Date],0))),(VLOOKUP(VLOOKUP(WEEKDAY(DATE($A$2,INT((COLUMN()-1)/31.001)+$A$1,ROUNDUP(MOD(COLUMN()-1,31.001),0)),2),Sheet3!$D$1:$E$7,2,0),$NR$11:$NS$17,2,0)=\"Yes\"))","v":true},{"$f":"AND(NOT(ISNUMBER(MATCH(DATE($A$2,INT((COLUMN()-1)/31.001)+$A$1,ROUNDUP(MOD(COLUMN()-1,31.001),0)),HolidayList[Date],0))),(VLOOKUP(VLOOKUP(WEEKDAY(DATE($A$2,INT((COLUMN()-1)/31.001)+$A$1,ROUNDUP(MOD(COLUMN()-1,31.001),0)),2),Sheet3!$D$1:$E$7,2,0),$NR$11:$NS$17,2,0)=\"Yes\"))","v":false},{"$f":"AND(NOT(ISNUMBER(MATCH(DATE($A$2,INT((COLUMN()-1)/31.001)+$A$1,ROUNDUP(MOD(COLUMN()-1,31.001),0)),HolidayList[Date],0))),(VLOOKUP(VLOOKUP(WEEKDAY(DATE($A$2,INT((COLUMN()-1)/31.001)+$A$1,ROUNDUP(MOD(COLUMN()-1,31.001),0)),2),Sheet3!$D$1:$E$7,2,0),$NR$11:$NS$17,2,0)=\"Yes\"))","v":false},{"$f":"AND(NOT(ISNUMBER(MATCH(DATE($A$2,INT((COLUMN()-1)/31.001)+$A$1,ROUNDUP(MOD(COLUMN()-1,31.001),0)),HolidayList[Date],0))),(VLOOKUP(VLOOKUP(WEEKDAY(DATE($A$2,INT((COLUMN()-1)/31.001)+$A$1,ROUNDUP(MOD(COLUMN()-1,31.001),0)),2),Sheet3!$D$1:$E$7,2,0),$NR$11:$NS$17,2,0)=\"Yes\"))","v":true},{"$f":"AND(NOT(ISNUMBER(MATCH(DATE($A$2,INT((COLUMN()-1)/31.001)+$A$1,ROUNDUP(MOD(COLUMN()-1,31.001),0)),HolidayList[Date],0))),(VLOOKUP(VLOOKUP(WEEKDAY(DATE($A$2,INT((COLUMN()-1)/31.001)+$A$1,ROUNDUP(MOD(COLUMN()-1,31.001),0)),2),Sheet3!$D$1:$E$7,2,0),$NR$11:$NS$17,2,0)=\"Yes\"))","v":true},{"$f":"AND(NOT(ISNUMBER(MATCH(DATE($A$2,INT((COLUMN()-1)/31.001)+$A$1,ROUNDUP(MOD(COLUMN()-1,31.001),0)),HolidayList[Date],0))),(VLOOKUP(VLOOKUP(WEEKDAY(DATE($A$2,INT((COLUMN()-1)/31.001)+$A$1,ROUNDUP(MOD(COLUMN()-1,31.001),0)),2),Sheet3!$D$1:$E$7,2,0),$NR$11:$NS$17,2,0)=\"Yes\"))","v":true},{"$f":"AND(NOT(ISNUMBER(MATCH(DATE($A$2,INT((COLUMN()-1)/31.001)+$A$1,ROUNDUP(MOD(COLUMN()-1,31.001),0)),HolidayList[Date],0))),(VLOOKUP(VLOOKUP(WEEKDAY(DATE($A$2,INT((COLUMN()-1)/31.001)+$A$1,ROUNDUP(MOD(COLUMN()-1,31.001),0)),2),Sheet3!$D$1:$E$7,2,0),$NR$11:$NS$17,2,0)=\"Yes\"))","v":true},{"$f":"AND(NOT(ISNUMBER(MATCH(DATE($A$2,INT((COLUMN()-1)/31.001)+$A$1,ROUNDUP(MOD(COLUMN()-1,31.001),0)),HolidayList[Date],0))),(VLOOKUP(VLOOKUP(WEEKDAY(DATE($A$2,INT((COLUMN()-1)/31.001)+$A$1,ROUNDUP(MOD(COLUMN()-1,31.001),0)),2),Sheet3!$D$1:$E$7,2,0),$NR$11:$NS$17,2,0)=\"Yes\"))","v":true},{"$f":"AND(NOT(ISNUMBER(MATCH(DATE($A$2,INT((COLUMN()-1)/31.001)+$A$1,ROUNDUP(MOD(COLUMN()-1,31.001),0)),HolidayList[Date],0))),(VLOOKUP(VLOOKUP(WEEKDAY(DATE($A$2,INT((COLUMN()-1)/31.001)+$A$1,ROUNDUP(MOD(COLUMN()-1,31.001),0)),2),Sheet3!$D$1:$E$7,2,0),$NR$11:$NS$17,2,0)=\"Yes\"))","v":false},{"$f":"AND(NOT(ISNUMBER(MATCH(DATE($A$2,INT((COLUMN()-1)/31.001)+$A$1,ROUNDUP(MOD(COLUMN()-1,31.001),0)),HolidayList[Date],0))),(VLOOKUP(VLOOKUP(WEEKDAY(DATE($A$2,INT((COLUMN()-1)/31.001)+$A$1,ROUNDUP(MOD(COLUMN()-1,31.001),0)),2),Sheet3!$D$1:$E$7,2,0),$NR$11:$NS$17,2,0)=\"Yes\"))","v":false},{"$f":"AND(NOT(ISNUMBER(MATCH(DATE($A$2,INT((COLUMN()-1)/31.001)+$A$1,ROUNDUP(MOD(COLUMN()-1,31.001),0)),HolidayList[Date],0))),(VLOOKUP(VLOOKUP(WEEKDAY(DATE($A$2,INT((COLUMN()-1)/31.001)+$A$1,ROUNDUP(MOD(COLUMN()-1,31.001),0)),2),Sheet3!$D$1:$E$7,2,0),$NR$11:$NS$17,2,0)=\"Yes\"))","v":true},{"$f":"AND(NOT(ISNUMBER(MATCH(DATE($A$2,INT((COLUMN()-1)/31.001)+$A$1,ROUNDUP(MOD(COLUMN()-1,31.001),0)),HolidayList[Date],0))),(VLOOKUP(VLOOKUP(WEEKDAY(DATE($A$2,INT((COLUMN()-1)/31.001)+$A$1,ROUNDUP(MOD(COLUMN()-1,31.001),0)),2),Sheet3!$D$1:$E$7,2,0),$NR$11:$NS$17,2,0)=\"Yes\"))","v":true},{"$f":"AND(NOT(ISNUMBER(MATCH(DATE($A$2,INT((COLUMN()-1)/31.001)+$A$1,ROUNDUP(MOD(COLUMN()-1,31.001),0)),HolidayList[Date],0))),(VLOOKUP(VLOOKUP(WEEKDAY(DATE($A$2,INT((COLUMN()-1)/31.001)+$A$1,ROUNDUP(MOD(COLUMN()-1,31.001),0)),2),Sheet3!$D$1:$E$7,2,0),$NR$11:$NS$17,2,0)=\"Yes\"))","v":true},{"$f":"AND(NOT(ISNUMBER(MATCH(DATE($A$2,INT((COLUMN()-1)/31.001)+$A$1,ROUNDUP(MOD(COLUMN()-1,31.001),0)),HolidayList[Date],0))),(VLOOKUP(VLOOKUP(WEEKDAY(DATE($A$2,INT((COLUMN()-1)/31.001)+$A$1,ROUNDUP(MOD(COLUMN()-1,31.001),0)),2),Sheet3!$D$1:$E$7,2,0),$NR$11:$NS$17,2,0)=\"Yes\"))","v":true},{"$f":"AND(NOT(ISNUMBER(MATCH(DATE($A$2,INT((COLUMN()-1)/31.001)+$A$1,ROUNDUP(MOD(COLUMN()-1,31.001),0)),HolidayList[Date],0))),(VLOOKUP(VLOOKUP(WEEKDAY(DATE($A$2,INT((COLUMN()-1)/31.001)+$A$1,ROUNDUP(MOD(COLUMN()-1,31.001),0)),2),Sheet3!$D$1:$E$7,2,0),$NR$11:$NS$17,2,0)=\"Yes\"))","v":true},{"$f":"AND(NOT(ISNUMBER(MATCH(DATE($A$2,INT((COLUMN()-1)/31.001)+$A$1,ROUNDUP(MOD(COLUMN()-1,31.001),0)),HolidayList[Date],0))),(VLOOKUP(VLOOKUP(WEEKDAY(DATE($A$2,INT((COLUMN()-1)/31.001)+$A$1,ROUNDUP(MOD(COLUMN()-1,31.001),0)),2),Sheet3!$D$1:$E$7,2,0),$NR$11:$NS$17,2,0)=\"Yes\"))","v":false},{"$f":"AND(NOT(ISNUMBER(MATCH(DATE($A$2,INT((COLUMN()-1)/31.001)+$A$1,ROUNDUP(MOD(COLUMN()-1,31.001),0)),HolidayList[Date],0))),(VLOOKUP(VLOOKUP(WEEKDAY(DATE($A$2,INT((COLUMN()-1)/31.001)+$A$1,ROUNDUP(MOD(COLUMN()-1,31.001),0)),2),Sheet3!$D$1:$E$7,2,0),$NR$11:$NS$17,2,0)=\"Yes\"))","v":false},{"$f":"AND(NOT(ISNUMBER(MATCH(DATE($A$2,INT((COLUMN()-1)/31.001)+$A$1,ROUNDUP(MOD(COLUMN()-1,31.001),0)),HolidayList[Date],0))),(VLOOKUP(VLOOKUP(WEEKDAY(DATE($A$2,INT((COLUMN()-1)/31.001)+$A$1,ROUNDUP(MOD(COLUMN()-1,31.001),0)),2),Sheet3!$D$1:$E$7,2,0),$NR$11:$NS$17,2,0)=\"Yes\"))","v":true},{"$f":"AND(NOT(ISNUMBER(MATCH(DATE($A$2,INT((COLUMN()-1)/31.001)+$A$1,ROUNDUP(MOD(COLUMN()-1,31.001),0)),HolidayList[Date],0))),(VLOOKUP(VLOOKUP(WEEKDAY(DATE($A$2,INT((COLUMN()-1)/31.001)+$A$1,ROUNDUP(MOD(COLUMN()-1,31.001),0)),2),Sheet3!$D$1:$E$7,2,0),$NR$11:$NS$17,2,0)=\"Yes\"))","v":true},{"$f":"AND(NOT(ISNUMBER(MATCH(DATE($A$2,INT((COLUMN()-1)/31.001)+$A$1,ROUNDUP(MOD(COLUMN()-1,31.001),0)),HolidayList[Date],0))),(VLOOKUP(VLOOKUP(WEEKDAY(DATE($A$2,INT((COLUMN()-1)/31.001)+$A$1,ROUNDUP(MOD(COLUMN()-1,31.001),0)),2),Sheet3!$D$1:$E$7,2,0),$NR$11:$NS$17,2,0)=\"Yes\"))","v":true},{"$f":"AND(NOT(ISNUMBER(MATCH(DATE($A$2,INT((COLUMN()-1)/31.001)+$A$1,ROUNDUP(MOD(COLUMN()-1,31.001),0)),HolidayList[Date],0))),(VLOOKUP(VLOOKUP(WEEKDAY(DATE($A$2,INT((COLUMN()-1)/31.001)+$A$1,ROUNDUP(MOD(COLUMN()-1,31.001),0)),2),Sheet3!$D$1:$E$7,2,0),$NR$11:$NS$17,2,0)=\"Yes\"))","v":true},{"$f":"AND(NOT(ISNUMBER(MATCH(DATE($A$2,INT((COLUMN()-1)/31.001)+$A$1,ROUNDUP(MOD(COLUMN()-1,31.001),0)),HolidayList[Date],0))),(VLOOKUP(VLOOKUP(WEEKDAY(DATE($A$2,INT((COLUMN()-1)/31.001)+$A$1,ROUNDUP(MOD(COLUMN()-1,31.001),0)),2),Sheet3!$D$1:$E$7,2,0),$NR$11:$NS$17,2,0)=\"Yes\"))","v":true},{"$f":"AND(NOT(ISNUMBER(MATCH(DATE($A$2,INT((COLUMN()-1)/31.001)+$A$1,ROUNDUP(MOD(COLUMN()-1,31.001),0)),HolidayList[Date],0))),(VLOOKUP(VLOOKUP(WEEKDAY(DATE($A$2,INT((COLUMN()-1)/31.001)+$A$1,ROUNDUP(MOD(COLUMN()-1,31.001),0)),2),Sheet3!$D$1:$E$7,2,0),$NR$11:$NS$17,2,0)=\"Yes\"))","v":false},{"$f":"AND(NOT(ISNUMBER(MATCH(DATE($A$2,INT((COLUMN()-1)/31.001)+$A$1,ROUNDUP(MOD(COLUMN()-1,31.001),0)),HolidayList[Date],0))),(VLOOKUP(VLOOKUP(WEEKDAY(DATE($A$2,INT((COLUMN()-1)/31.001)+$A$1,ROUNDUP(MOD(COLUMN()-1,31.001),0)),2),Sheet3!$D$1:$E$7,2,0),$NR$11:$NS$17,2,0)=\"Yes\"))","v":false},{"$f":"AND(NOT(ISNUMBER(MATCH(DATE($A$2,INT((COLUMN()-1)/31.001)+$A$1,ROUNDUP(MOD(COLUMN()-1,31.001),0)),HolidayList[Date],0))),(VLOOKUP(VLOOKUP(WEEKDAY(DATE($A$2,INT((COLUMN()-1)/31.001)+$A$1,ROUNDUP(MOD(COLUMN()-1,31.001),0)),2),Sheet3!$D$1:$E$7,2,0),$NR$11:$NS$17,2,0)=\"Yes\"))","v":true},{"$f":"AND(NOT(ISNUMBER(MATCH(DATE($A$2,INT((COLUMN()-1)/31.001)+$A$1,ROUNDUP(MOD(COLUMN()-1,31.001),0)),HolidayList[Date],0))),(VLOOKUP(VLOOKUP(WEEKDAY(DATE($A$2,INT((COLUMN()-1)/31.001)+$A$1,ROUNDUP(MOD(COLUMN()-1,31.001),0)),2),Sheet3!$D$1:$E$7,2,0),$NR$11:$NS$17,2,0)=\"Yes\"))","v":true},{"$f":"AND(NOT(ISNUMBER(MATCH(DATE($A$2,INT((COLUMN()-1)/31.001)+$A$1,ROUNDUP(MOD(COLUMN()-1,31.001),0)),HolidayList[Date],0))),(VLOOKUP(VLOOKUP(WEEKDAY(DATE($A$2,INT((COLUMN()-1)/31.001)+$A$1,ROUNDUP(MOD(COLUMN()-1,31.001),0)),2),Sheet3!$D$1:$E$7,2,0),$NR$11:$NS$17,2,0)=\"Yes\"))","v":true},{"$f":"AND(NOT(ISNUMBER(MATCH(DATE($A$2,INT((COLUMN()-1)/31.001)+$A$1,ROUNDUP(MOD(COLUMN()-1,31.001),0)),HolidayList[Date],0))),(VLOOKUP(VLOOKUP(WEEKDAY(DATE($A$2,INT((COLUMN()-1)/31.001)+$A$1,ROUNDUP(MOD(COLUMN()-1,31.001),0)),2),Sheet3!$D$1:$E$7,2,0),$NR$11:$NS$17,2,0)=\"Yes\"))","v":true},{"$f":"AND(NOT(ISNUMBER(MATCH(DATE($A$2,INT((COLUMN()-1)/31.001)+$A$1,ROUNDUP(MOD(COLUMN()-1,31.001),0)),HolidayList[Date],0))),(VLOOKUP(VLOOKUP(WEEKDAY(DATE($A$2,INT((COLUMN()-1)/31.001)+$A$1,ROUNDUP(MOD(COLUMN()-1,31.001),0)),2),Sheet3!$D$1:$E$7,2,0),$NR$11:$NS$17,2,0)=\"Yes\"))","v":true},{"$f":"AND(NOT(ISNUMBER(MATCH(DATE($A$2,INT((COLUMN()-1)/31.001)+$A$1,ROUNDUP(MOD(COLUMN()-1,31.001),0)),HolidayList[Date],0))),(VLOOKUP(VLOOKUP(WEEKDAY(DATE($A$2,INT((COLUMN()-1)/31.001)+$A$1,ROUNDUP(MOD(COLUMN()-1,31.001),0)),2),Sheet3!$D$1:$E$7,2,0),$NR$11:$NS$17,2,0)=\"Yes\"))","v":false},{"$f":"AND(NOT(ISNUMBER(MATCH(DATE($A$2,INT((COLUMN()-1)/31.001)+$A$1,ROUNDUP(MOD(COLUMN()-1,31.001),0)),HolidayList[Date],0))),(VLOOKUP(VLOOKUP(WEEKDAY(DATE($A$2,INT((COLUMN()-1)/31.001)+$A$1,ROUNDUP(MOD(COLUMN()-1,31.001),0)),2),Sheet3!$D$1:$E$7,2,0),$NR$11:$NS$17,2,0)=\"Yes\"))","v":false},{"$f":"AND(NOT(ISNUMBER(MATCH(DATE($A$2,INT((COLUMN()-1)/31.001)+$A$1,ROUNDUP(MOD(COLUMN()-1,31.001),0)),HolidayList[Date],0))),(VLOOKUP(VLOOKUP(WEEKDAY(DATE($A$2,INT((COLUMN()-1)/31.001)+$A$1,ROUNDUP(MOD(COLUMN()-1,31.001),0)),2),Sheet3!$D$1:$E$7,2,0),$NR$11:$NS$17,2,0)=\"Yes\"))","v":true},{"$f":"AND(NOT(ISNUMBER(MATCH(DATE($A$2,INT((COLUMN()-1)/31.001)+$A$1,ROUNDUP(MOD(COLUMN()-1,31.001),0)),HolidayList[Date],0))),(VLOOKUP(VLOOKUP(WEEKDAY(DATE($A$2,INT((COLUMN()-1)/31.001)+$A$1,ROUNDUP(MOD(COLUMN()-1,31.001),0)),2),Sheet3!$D$1:$E$7,2,0),$NR$11:$NS$17,2,0)=\"Yes\"))","v":true},{"$f":"AND(NOT(ISNUMBER(MATCH(DATE($A$2,INT((COLUMN()-1)/31.001)+$A$1,ROUNDUP(MOD(COLUMN()-1,31.001),0)),HolidayList[Date],0))),(VLOOKUP(VLOOKUP(WEEKDAY(DATE($A$2,INT((COLUMN()-1)/31.001)+$A$1,ROUNDUP(MOD(COLUMN()-1,31.001),0)),2),Sheet3!$D$1:$E$7,2,0),$NR$11:$NS$17,2,0)=\"Yes\"))","v":true},{"$f":"AND(NOT(ISNUMBER(MATCH(DATE($A$2,INT((COLUMN()-1)/31.001)+$A$1,ROUNDUP(MOD(COLUMN()-1,31.001),0)),HolidayList[Date],0))),(VLOOKUP(VLOOKUP(WEEKDAY(DATE($A$2,INT((COLUMN()-1)/31.001)+$A$1,ROUNDUP(MOD(COLUMN()-1,31.001),0)),2),Sheet3!$D$1:$E$7,2,0),$NR$11:$NS$17,2,0)=\"Yes\"))","v":true},{"$f":"AND(NOT(ISNUMBER(MATCH(DATE($A$2,INT((COLUMN()-1)/31.001)+$A$1,ROUNDUP(MOD(COLUMN()-1,31.001),0)),HolidayList[Date],0))),(VLOOKUP(VLOOKUP(WEEKDAY(DATE($A$2,INT((COLUMN()-1)/31.001)+$A$1,ROUNDUP(MOD(COLUMN()-1,31.001),0)),2),Sheet3!$D$1:$E$7,2,0),$NR$11:$NS$17,2,0)=\"Yes\"))","v":true},{"$f":"AND(NOT(ISNUMBER(MATCH(DATE($A$2,INT((COLUMN()-1)/31.001)+$A$1,ROUNDUP(MOD(COLUMN()-1,31.001),0)),HolidayList[Date],0))),(VLOOKUP(VLOOKUP(WEEKDAY(DATE($A$2,INT((COLUMN()-1)/31.001)+$A$1,ROUNDUP(MOD(COLUMN()-1,31.001),0)),2),Sheet3!$D$1:$E$7,2,0),$NR$11:$NS$17,2,0)=\"Yes\"))","v":false},{"$f":"AND(NOT(ISNUMBER(MATCH(DATE($A$2,INT((COLUMN()-1)/31.001)+$A$1,ROUNDUP(MOD(COLUMN()-1,31.001),0)),HolidayList[Date],0))),(VLOOKUP(VLOOKUP(WEEKDAY(DATE($A$2,INT((COLUMN()-1)/31.001)+$A$1,ROUNDUP(MOD(COLUMN()-1,31.001),0)),2),Sheet3!$D$1:$E$7,2,0),$NR$11:$NS$17,2,0)=\"Yes\"))","v":false},{"$f":"AND(NOT(ISNUMBER(MATCH(DATE($A$2,INT((COLUMN()-1)/31.001)+$A$1,ROUNDUP(MOD(COLUMN()-1,31.001),0)),HolidayList[Date],0))),(VLOOKUP(VLOOKUP(WEEKDAY(DATE($A$2,INT((COLUMN()-1)/31.001)+$A$1,ROUNDUP(MOD(COLUMN()-1,31.001),0)),2),Sheet3!$D$1:$E$7,2,0),$NR$11:$NS$17,2,0)=\"Yes\"))","v":true},{"$f":"AND(NOT(ISNUMBER(MATCH(DATE($A$2,INT((COLUMN()-1)/31.001)+$A$1,ROUNDUP(MOD(COLUMN()-1,31.001),0)),HolidayList[Date],0))),(VLOOKUP(VLOOKUP(WEEKDAY(DATE($A$2,INT((COLUMN()-1)/31.001)+$A$1,ROUNDUP(MOD(COLUMN()-1,31.001),0)),2),Sheet3!$D$1:$E$7,2,0),$NR$11:$NS$17,2,0)=\"Yes\"))","v":true},{"$f":"AND(NOT(ISNUMBER(MATCH(DATE($A$2,INT((COLUMN()-1)/31.001)+$A$1,ROUNDUP(MOD(COLUMN()-1,31.001),0)),HolidayList[Date],0))),(VLOOKUP(VLOOKUP(WEEKDAY(DATE($A$2,INT((COLUMN()-1)/31.001)+$A$1,ROUNDUP(MOD(COLUMN()-1,31.001),0)),2),Sheet3!$D$1:$E$7,2,0),$NR$11:$NS$17,2,0)=\"Yes\"))","v":true},{"$f":"AND(NOT(ISNUMBER(MATCH(DATE($A$2,INT((COLUMN()-1)/31.001)+$A$1,ROUNDUP(MOD(COLUMN()-1,31.001),0)),HolidayList[Date],0))),(VLOOKUP(VLOOKUP(WEEKDAY(DATE($A$2,INT((COLUMN()-1)/31.001)+$A$1,ROUNDUP(MOD(COLUMN()-1,31.001),0)),2),Sheet3!$D$1:$E$7,2,0),$NR$11:$NS$17,2,0)=\"Yes\"))","v":true},{"$f":"AND(NOT(ISNUMBER(MATCH(DATE($A$2,INT((COLUMN()-1)/31.001)+$A$1,ROUNDUP(MOD(COLUMN()-1,31.001),0)),HolidayList[Date],0))),(VLOOKUP(VLOOKUP(WEEKDAY(DATE($A$2,INT((COLUMN()-1)/31.001)+$A$1,ROUNDUP(MOD(COLUMN()-1,31.001),0)),2),Sheet3!$D$1:$E$7,2,0),$NR$11:$NS$17,2,0)=\"Yes\"))","v":true},{"$f":"AND(NOT(ISNUMBER(MATCH(DATE($A$2,INT((COLUMN()-1)/31.001)+$A$1,ROUNDUP(MOD(COLUMN()-1,31.001),0)),HolidayList[Date],0))),(VLOOKUP(VLOOKUP(WEEKDAY(DATE($A$2,INT((COLUMN()-1)/31.001)+$A$1,ROUNDUP(MOD(COLUMN()-1,31.001),0)),2),Sheet3!$D$1:$E$7,2,0),$NR$11:$NS$17,2,0)=\"Yes\"))","v":false},{"$f":"AND(NOT(ISNUMBER(MATCH(DATE($A$2,INT((COLUMN()-1)/31.001)+$A$1,ROUNDUP(MOD(COLUMN()-1,31.001),0)),HolidayList[Date],0))),(VLOOKUP(VLOOKUP(WEEKDAY(DATE($A$2,INT((COLUMN()-1)/31.001)+$A$1,ROUNDUP(MOD(COLUMN()-1,31.001),0)),2),Sheet3!$D$1:$E$7,2,0),$NR$11:$NS$17,2,0)=\"Yes\"))","v":false},{"$f":"AND(NOT(ISNUMBER(MATCH(DATE($A$2,INT((COLUMN()-1)/31.001)+$A$1,ROUNDUP(MOD(COLUMN()-1,31.001),0)),HolidayList[Date],0))),(VLOOKUP(VLOOKUP(WEEKDAY(DATE($A$2,INT((COLUMN()-1)/31.001)+$A$1,ROUNDUP(MOD(COLUMN()-1,31.001),0)),2),Sheet3!$D$1:$E$7,2,0),$NR$11:$NS$17,2,0)=\"Yes\"))","v":true},{"$f":"AND(NOT(ISNUMBER(MATCH(DATE($A$2,INT((COLUMN()-1)/31.001)+$A$1,ROUNDUP(MOD(COLUMN()-1,31.001),0)),HolidayList[Date],0))),(VLOOKUP(VLOOKUP(WEEKDAY(DATE($A$2,INT((COLUMN()-1)/31.001)+$A$1,ROUNDUP(MOD(COLUMN()-1,31.001),0)),2),Sheet3!$D$1:$E$7,2,0),$NR$11:$NS$17,2,0)=\"Yes\"))","v":true},{"$f":"AND(NOT(ISNUMBER(MATCH(DATE($A$2,INT((COLUMN()-1)/31.001)+$A$1,ROUNDUP(MOD(COLUMN()-1,31.001),0)),HolidayList[Date],0))),(VLOOKUP(VLOOKUP(WEEKDAY(DATE($A$2,INT((COLUMN()-1)/31.001)+$A$1,ROUNDUP(MOD(COLUMN()-1,31.001),0)),2),Sheet3!$D$1:$E$7,2,0),$NR$11:$NS$17,2,0)=\"Yes\"))","v":true},{"$f":"AND(NOT(ISNUMBER(MATCH(DATE($A$2,INT((COLUMN()-1)/31.001)+$A$1,ROUNDUP(MOD(COLUMN()-1,31.001),0)),HolidayList[Date],0))),(VLOOKUP(VLOOKUP(WEEKDAY(DATE($A$2,INT((COLUMN()-1)/31.001)+$A$1,ROUNDUP(MOD(COLUMN()-1,31.001),0)),2),Sheet3!$D$1:$E$7,2,0),$NR$11:$NS$17,2,0)=\"Yes\"))","v":true},{"$f":"AND(NOT(ISNUMBER(MATCH(DATE($A$2,INT((COLUMN()-1)/31.001)+$A$1,ROUNDUP(MOD(COLUMN()-1,31.001),0)),HolidayList[Date],0))),(VLOOKUP(VLOOKUP(WEEKDAY(DATE($A$2,INT((COLUMN()-1)/31.001)+$A$1,ROUNDUP(MOD(COLUMN()-1,31.001),0)),2),Sheet3!$D$1:$E$7,2,0),$NR$11:$NS$17,2,0)=\"Yes\"))","v":true},{"$f":"AND(NOT(ISNUMBER(MATCH(DATE($A$2,INT((COLUMN()-1)/31.001)+$A$1,ROUNDUP(MOD(COLUMN()-1,31.001),0)),HolidayList[Date],0))),(VLOOKUP(VLOOKUP(WEEKDAY(DATE($A$2,INT((COLUMN()-1)/31.001)+$A$1,ROUNDUP(MOD(COLUMN()-1,31.001),0)),2),Sheet3!$D$1:$E$7,2,0),$NR$11:$NS$17,2,0)=\"Yes\"))","v":true},{"$f":"AND(NOT(ISNUMBER(MATCH(DATE($A$2,INT((COLUMN()-1)/31.001)+$A$1,ROUNDUP(MOD(COLUMN()-1,31.001),0)),HolidayList[Date],0))),(VLOOKUP(VLOOKUP(WEEKDAY(DATE($A$2,INT((COLUMN()-1)/31.001)+$A$1,ROUNDUP(MOD(COLUMN()-1,31.001),0)),2),Sheet3!$D$1:$E$7,2,0),$NR$11:$NS$17,2,0)=\"Yes\"))","v":false},{"$f":"AND(NOT(ISNUMBER(MATCH(DATE($A$2,INT((COLUMN()-1)/31.001)+$A$1,ROUNDUP(MOD(COLUMN()-1,31.001),0)),HolidayList[Date],0))),(VLOOKUP(VLOOKUP(WEEKDAY(DATE($A$2,INT((COLUMN()-1)/31.001)+$A$1,ROUNDUP(MOD(COLUMN()-1,31.001),0)),2),Sheet3!$D$1:$E$7,2,0),$NR$11:$NS$17,2,0)=\"Yes\"))","v":false},{"$f":"AND(NOT(ISNUMBER(MATCH(DATE($A$2,INT((COLUMN()-1)/31.001)+$A$1,ROUNDUP(MOD(COLUMN()-1,31.001),0)),HolidayList[Date],0))),(VLOOKUP(VLOOKUP(WEEKDAY(DATE($A$2,INT((COLUMN()-1)/31.001)+$A$1,ROUNDUP(MOD(COLUMN()-1,31.001),0)),2),Sheet3!$D$1:$E$7,2,0),$NR$11:$NS$17,2,0)=\"Yes\"))","v":true},{"$f":"AND(NOT(ISNUMBER(MATCH(DATE($A$2,INT((COLUMN()-1)/31.001)+$A$1,ROUNDUP(MOD(COLUMN()-1,31.001),0)),HolidayList[Date],0))),(VLOOKUP(VLOOKUP(WEEKDAY(DATE($A$2,INT((COLUMN()-1)/31.001)+$A$1,ROUNDUP(MOD(COLUMN()-1,31.001),0)),2),Sheet3!$D$1:$E$7,2,0),$NR$11:$NS$17,2,0)=\"Yes\"))","v":true},{"$f":"AND(NOT(ISNUMBER(MATCH(DATE($A$2,INT((COLUMN()-1)/31.001)+$A$1,ROUNDUP(MOD(COLUMN()-1,31.001),0)),HolidayList[Date],0))),(VLOOKUP(VLOOKUP(WEEKDAY(DATE($A$2,INT((COLUMN()-1)/31.001)+$A$1,ROUNDUP(MOD(COLUMN()-1,31.001),0)),2),Sheet3!$D$1:$E$7,2,0),$NR$11:$NS$17,2,0)=\"Yes\"))","v":true},{"$f":"AND(NOT(ISNUMBER(MATCH(DATE($A$2,INT((COLUMN()-1)/31.001)+$A$1,ROUNDUP(MOD(COLUMN()-1,31.001),0)),HolidayList[Date],0))),(VLOOKUP(VLOOKUP(WEEKDAY(DATE($A$2,INT((COLUMN()-1)/31.001)+$A$1,ROUNDUP(MOD(COLUMN()-1,31.001),0)),2),Sheet3!$D$1:$E$7,2,0),$NR$11:$NS$17,2,0)=\"Yes\"))","v":true},{"$f":"AND(NOT(ISNUMBER(MATCH(DATE($A$2,INT((COLUMN()-1)/31.001)+$A$1,ROUNDUP(MOD(COLUMN()-1,31.001),0)),HolidayList[Date],0))),(VLOOKUP(VLOOKUP(WEEKDAY(DATE($A$2,INT((COLUMN()-1)/31.001)+$A$1,ROUNDUP(MOD(COLUMN()-1,31.001),0)),2),Sheet3!$D$1:$E$7,2,0),$NR$11:$NS$17,2,0)=\"Yes\"))","v":true},{"$f":"AND(NOT(ISNUMBER(MATCH(DATE($A$2,INT((COLUMN()-1)/31.001)+$A$1,ROUNDUP(MOD(COLUMN()-1,31.001),0)),HolidayList[Date],0))),(VLOOKUP(VLOOKUP(WEEKDAY(DATE($A$2,INT((COLUMN()-1)/31.001)+$A$1,ROUNDUP(MOD(COLUMN()-1,31.001),0)),2),Sheet3!$D$1:$E$7,2,0),$NR$11:$NS$17,2,0)=\"Yes\"))","v":false},{"$f":"AND(NOT(ISNUMBER(MATCH(DATE($A$2,INT((COLUMN()-1)/31.001)+$A$1,ROUNDUP(MOD(COLUMN()-1,31.001),0)),HolidayList[Date],0))),(VLOOKUP(VLOOKUP(WEEKDAY(DATE($A$2,INT((COLUMN()-1)/31.001)+$A$1,ROUNDUP(MOD(COLUMN()-1,31.001),0)),2),Sheet3!$D$1:$E$7,2,0),$NR$11:$NS$17,2,0)=\"Yes\"))","v":false},{"$f":"AND(NOT(ISNUMBER(MATCH(DATE($A$2,INT((COLUMN()-1)/31.001)+$A$1,ROUNDUP(MOD(COLUMN()-1,31.001),0)),HolidayList[Date],0))),(VLOOKUP(VLOOKUP(WEEKDAY(DATE($A$2,INT((COLUMN()-1)/31.001)+$A$1,ROUNDUP(MOD(COLUMN()-1,31.001),0)),2),Sheet3!$D$1:$E$7,2,0),$NR$11:$NS$17,2,0)=\"Yes\"))","v":true},{"$f":"AND(NOT(ISNUMBER(MATCH(DATE($A$2,INT((COLUMN()-1)/31.001)+$A$1,ROUNDUP(MOD(COLUMN()-1,31.001),0)),HolidayList[Date],0))),(VLOOKUP(VLOOKUP(WEEKDAY(DATE($A$2,INT((COLUMN()-1)/31.001)+$A$1,ROUNDUP(MOD(COLUMN()-1,31.001),0)),2),Sheet3!$D$1:$E$7,2,0),$NR$11:$NS$17,2,0)=\"Yes\"))","v":true},{"$f":"AND(NOT(ISNUMBER(MATCH(DATE($A$2,INT((COLUMN()-1)/31.001)+$A$1,ROUNDUP(MOD(COLUMN()-1,31.001),0)),HolidayList[Date],0))),(VLOOKUP(VLOOKUP(WEEKDAY(DATE($A$2,INT((COLUMN()-1)/31.001)+$A$1,ROUNDUP(MOD(COLUMN()-1,31.001),0)),2),Sheet3!$D$1:$E$7,2,0),$NR$11:$NS$17,2,0)=\"Yes\"))","v":true},{"$f":"AND(NOT(ISNUMBER(MATCH(DATE($A$2,INT((COLUMN()-1)/31.001)+$A$1,ROUNDUP(MOD(COLUMN()-1,31.001),0)),HolidayList[Date],0))),(VLOOKUP(VLOOKUP(WEEKDAY(DATE($A$2,INT((COLUMN()-1)/31.001)+$A$1,ROUNDUP(MOD(COLUMN()-1,31.001),0)),2),Sheet3!$D$1:$E$7,2,0),$NR$11:$NS$17,2,0)=\"Yes\"))","v":true},{"$f":"AND(NOT(ISNUMBER(MATCH(DATE($A$2,INT((COLUMN()-1)/31.001)+$A$1,ROUNDUP(MOD(COLUMN()-1,31.001),0)),HolidayList[Date],0))),(VLOOKUP(VLOOKUP(WEEKDAY(DATE($A$2,INT((COLUMN()-1)/31.001)+$A$1,ROUNDUP(MOD(COLUMN()-1,31.001),0)),2),Sheet3!$D$1:$E$7,2,0),$NR$11:$NS$17,2,0)=\"Yes\"))","v":true},{"$f":"AND(NOT(ISNUMBER(MATCH(DATE($A$2,INT((COLUMN()-1)/31.001)+$A$1,ROUNDUP(MOD(COLUMN()-1,31.001),0)),HolidayList[Date],0))),(VLOOKUP(VLOOKUP(WEEKDAY(DATE($A$2,INT((COLUMN()-1)/31.001)+$A$1,ROUNDUP(MOD(COLUMN()-1,31.001),0)),2),Sheet3!$D$1:$E$7,2,0),$NR$11:$NS$17,2,0)=\"Yes\"))","v":false},{"$f":"AND(NOT(ISNUMBER(MATCH(DATE($A$2,INT((COLUMN()-1)/31.001)+$A$1,ROUNDUP(MOD(COLUMN()-1,31.001),0)),HolidayList[Date],0))),(VLOOKUP(VLOOKUP(WEEKDAY(DATE($A$2,INT((COLUMN()-1)/31.001)+$A$1,ROUNDUP(MOD(COLUMN()-1,31.001),0)),2),Sheet3!$D$1:$E$7,2,0),$NR$11:$NS$17,2,0)=\"Yes\"))","v":false},{"$f":"AND(NOT(ISNUMBER(MATCH(DATE($A$2,INT((COLUMN()-1)/31.001)+$A$1,ROUNDUP(MOD(COLUMN()-1,31.001),0)),HolidayList[Date],0))),(VLOOKUP(VLOOKUP(WEEKDAY(DATE($A$2,INT((COLUMN()-1)/31.001)+$A$1,ROUNDUP(MOD(COLUMN()-1,31.001),0)),2),Sheet3!$D$1:$E$7,2,0),$NR$11:$NS$17,2,0)=\"Yes\"))","v":true},{"$f":"AND(NOT(ISNUMBER(MATCH(DATE($A$2,INT((COLUMN()-1)/31.001)+$A$1,ROUNDUP(MOD(COLUMN()-1,31.001),0)),HolidayList[Date],0))),(VLOOKUP(VLOOKUP(WEEKDAY(DATE($A$2,INT((COLUMN()-1)/31.001)+$A$1,ROUNDUP(MOD(COLUMN()-1,31.001),0)),2),Sheet3!$D$1:$E$7,2,0),$NR$11:$NS$17,2,0)=\"Yes\"))","v":true},{"$f":"AND(NOT(ISNUMBER(MATCH(DATE($A$2,INT((COLUMN()-1)/31.001)+$A$1,ROUNDUP(MOD(COLUMN()-1,31.001),0)),HolidayList[Date],0))),(VLOOKUP(VLOOKUP(WEEKDAY(DATE($A$2,INT((COLUMN()-1)/31.001)+$A$1,ROUNDUP(MOD(COLUMN()-1,31.001),0)),2),Sheet3!$D$1:$E$7,2,0),$NR$11:$NS$17,2,0)=\"Yes\"))","v":true},{"$f":"AND(NOT(ISNUMBER(MATCH(DATE($A$2,INT((COLUMN()-1)/31.001)+$A$1,ROUNDUP(MOD(COLUMN()-1,31.001),0)),HolidayList[Date],0))),(VLOOKUP(VLOOKUP(WEEKDAY(DATE($A$2,INT((COLUMN()-1)/31.001)+$A$1,ROUNDUP(MOD(COLUMN()-1,31.001),0)),2),Sheet3!$D$1:$E$7,2,0),$NR$11:$NS$17,2,0)=\"Yes\"))","v":true},{"$f":"AND(NOT(ISNUMBER(MATCH(DATE($A$2,INT((COLUMN()-1)/31.001)+$A$1,ROUNDUP(MOD(COLUMN()-1,31.001),0)),HolidayList[Date],0))),(VLOOKUP(VLOOKUP(WEEKDAY(DATE($A$2,INT((COLUMN()-1)/31.001)+$A$1,ROUNDUP(MOD(COLUMN()-1,31.001),0)),2),Sheet3!$D$1:$E$7,2,0),$NR$11:$NS$17,2,0)=\"Yes\"))","v":true},{"$f":"AND(NOT(ISNUMBER(MATCH(DATE($A$2,INT((COLUMN()-1)/31.001)+$A$1,ROUNDUP(MOD(COLUMN()-1,31.001),0)),HolidayList[Date],0))),(VLOOKUP(VLOOKUP(WEEKDAY(DATE($A$2,INT((COLUMN()-1)/31.001)+$A$1,ROUNDUP(MOD(COLUMN()-1,31.001),0)),2),Sheet3!$D$1:$E$7,2,0),$NR$11:$NS$17,2,0)=\"Yes\"))","v":false},{"$f":"AND(NOT(ISNUMBER(MATCH(DATE($A$2,INT((COLUMN()-1)/31.001)+$A$1,ROUNDUP(MOD(COLUMN()-1,31.001),0)),HolidayList[Date],0))),(VLOOKUP(VLOOKUP(WEEKDAY(DATE($A$2,INT((COLUMN()-1)/31.001)+$A$1,ROUNDUP(MOD(COLUMN()-1,31.001),0)),2),Sheet3!$D$1:$E$7,2,0),$NR$11:$NS$17,2,0)=\"Yes\"))","v":false},{"$f":"AND(NOT(ISNUMBER(MATCH(DATE($A$2,INT((COLUMN()-1)/31.001)+$A$1,ROUNDUP(MOD(COLUMN()-1,31.001),0)),HolidayList[Date],0))),(VLOOKUP(VLOOKUP(WEEKDAY(DATE($A$2,INT((COLUMN()-1)/31.001)+$A$1,ROUNDUP(MOD(COLUMN()-1,31.001),0)),2),Sheet3!$D$1:$E$7,2,0),$NR$11:$NS$17,2,0)=\"Yes\"))","v":false},{"$f":"AND(NOT(ISNUMBER(MATCH(DATE($A$2,INT((COLUMN()-1)/31.001)+$A$1,ROUNDUP(MOD(COLUMN()-1,31.001),0)),HolidayList[Date],0))),(VLOOKUP(VLOOKUP(WEEKDAY(DATE($A$2,INT((COLUMN()-1)/31.001)+$A$1,ROUNDUP(MOD(COLUMN()-1,31.001),0)),2),Sheet3!$D$1:$E$7,2,0),$NR$11:$NS$17,2,0)=\"Yes\"))","v":true},{"$f":"AND(NOT(ISNUMBER(MATCH(DATE($A$2,INT((COLUMN()-1)/31.001)+$A$1,ROUNDUP(MOD(COLUMN()-1,31.001),0)),HolidayList[Date],0))),(VLOOKUP(VLOOKUP(WEEKDAY(DATE($A$2,INT((COLUMN()-1)/31.001)+$A$1,ROUNDUP(MOD(COLUMN()-1,31.001),0)),2),Sheet3!$D$1:$E$7,2,0),$NR$11:$NS$17,2,0)=\"Yes\"))","v":true},{"$f":"AND(NOT(ISNUMBER(MATCH(DATE($A$2,INT((COLUMN()-1)/31.001)+$A$1,ROUNDUP(MOD(COLUMN()-1,31.001),0)),HolidayList[Date],0))),(VLOOKUP(VLOOKUP(WEEKDAY(DATE($A$2,INT((COLUMN()-1)/31.001)+$A$1,ROUNDUP(MOD(COLUMN()-1,31.001),0)),2),Sheet3!$D$1:$E$7,2,0),$NR$11:$NS$17,2,0)=\"Yes\"))","v":true},{"$f":"AND(NOT(ISNUMBER(MATCH(DATE($A$2,INT((COLUMN()-1)/31.001)+$A$1,ROUNDUP(MOD(COLUMN()-1,31.001),0)),HolidayList[Date],0))),(VLOOKUP(VLOOKUP(WEEKDAY(DATE($A$2,INT((COLUMN()-1)/31.001)+$A$1,ROUNDUP(MOD(COLUMN()-1,31.001),0)),2),Sheet3!$D$1:$E$7,2,0),$NR$11:$NS$17,2,0)=\"Yes\"))","v":true},{"$f":"AND(NOT(ISNUMBER(MATCH(DATE($A$2,INT((COLUMN()-1)/31.001)+$A$1,ROUNDUP(MOD(COLUMN()-1,31.001),0)),HolidayList[Date],0))),(VLOOKUP(VLOOKUP(WEEKDAY(DATE($A$2,INT((COLUMN()-1)/31.001)+$A$1,ROUNDUP(MOD(COLUMN()-1,31.001),0)),2),Sheet3!$D$1:$E$7,2,0),$NR$11:$NS$17,2,0)=\"Yes\"))","v":false},{"$f":"AND(NOT(ISNUMBER(MATCH(DATE($A$2,INT((COLUMN()-1)/31.001)+$A$1,ROUNDUP(MOD(COLUMN()-1,31.001),0)),HolidayList[Date],0))),(VLOOKUP(VLOOKUP(WEEKDAY(DATE($A$2,INT((COLUMN()-1)/31.001)+$A$1,ROUNDUP(MOD(COLUMN()-1,31.001),0)),2),Sheet3!$D$1:$E$7,2,0),$NR$11:$NS$17,2,0)=\"Yes\"))","v":false},{"$f":"AND(NOT(ISNUMBER(MATCH(DATE($A$2,INT((COLUMN()-1)/31.001)+$A$1,ROUNDUP(MOD(COLUMN()-1,31.001),0)),HolidayList[Date],0))),(VLOOKUP(VLOOKUP(WEEKDAY(DATE($A$2,INT((COLUMN()-1)/31.001)+$A$1,ROUNDUP(MOD(COLUMN()-1,31.001),0)),2),Sheet3!$D$1:$E$7,2,0),$NR$11:$NS$17,2,0)=\"Yes\"))","v":true},{"$f":"AND(NOT(ISNUMBER(MATCH(DATE($A$2,INT((COLUMN()-1)/31.001)+$A$1,ROUNDUP(MOD(COLUMN()-1,31.001),0)),HolidayList[Date],0))),(VLOOKUP(VLOOKUP(WEEKDAY(DATE($A$2,INT((COLUMN()-1)/31.001)+$A$1,ROUNDUP(MOD(COLUMN()-1,31.001),0)),2),Sheet3!$D$1:$E$7,2,0),$NR$11:$NS$17,2,0)=\"Yes\"))","v":true},{"$f":"AND(NOT(ISNUMBER(MATCH(DATE($A$2,INT((COLUMN()-1)/31.001)+$A$1,ROUNDUP(MOD(COLUMN()-1,31.001),0)),HolidayList[Date],0))),(VLOOKUP(VLOOKUP(WEEKDAY(DATE($A$2,INT((COLUMN()-1)/31.001)+$A$1,ROUNDUP(MOD(COLUMN()-1,31.001),0)),2),Sheet3!$D$1:$E$7,2,0),$NR$11:$NS$17,2,0)=\"Yes\"))","v":true},{"$f":"AND(NOT(ISNUMBER(MATCH(DATE($A$2,INT((COLUMN()-1)/31.001)+$A$1,ROUNDUP(MOD(COLUMN()-1,31.001),0)),HolidayList[Date],0))),(VLOOKUP(VLOOKUP(WEEKDAY(DATE($A$2,INT((COLUMN()-1)/31.001)+$A$1,ROUNDUP(MOD(COLUMN()-1,31.001),0)),2),Sheet3!$D$1:$E$7,2,0),$NR$11:$NS$17,2,0)=\"Yes\"))","v":true},{"$f":"AND(NOT(ISNUMBER(MATCH(DATE($A$2,INT((COLUMN()-1)/31.001)+$A$1,ROUNDUP(MOD(COLUMN()-1,31.001),0)),HolidayList[Date],0))),(VLOOKUP(VLOOKUP(WEEKDAY(DATE($A$2,INT((COLUMN()-1)/31.001)+$A$1,ROUNDUP(MOD(COLUMN()-1,31.001),0)),2),Sheet3!$D$1:$E$7,2,0),$NR$11:$NS$17,2,0)=\"Yes\"))","v":true},{"$f":"AND(NOT(ISNUMBER(MATCH(DATE($A$2,INT((COLUMN()-1)/31.001)+$A$1,ROUNDUP(MOD(COLUMN()-1,31.001),0)),HolidayList[Date],0))),(VLOOKUP(VLOOKUP(WEEKDAY(DATE($A$2,INT((COLUMN()-1)/31.001)+$A$1,ROUNDUP(MOD(COLUMN()-1,31.001),0)),2),Sheet3!$D$1:$E$7,2,0),$NR$11:$NS$17,2,0)=\"Yes\"))","v":false},{"$f":"AND(NOT(ISNUMBER(MATCH(DATE($A$2,INT((COLUMN()-1)/31.001)+$A$1,ROUNDUP(MOD(COLUMN()-1,31.001),0)),HolidayList[Date],0))),(VLOOKUP(VLOOKUP(WEEKDAY(DATE($A$2,INT((COLUMN()-1)/31.001)+$A$1,ROUNDUP(MOD(COLUMN()-1,31.001),0)),2),Sheet3!$D$1:$E$7,2,0),$NR$11:$NS$17,2,0)=\"Yes\"))","v":false},{"$f":"AND(NOT(ISNUMBER(MATCH(DATE($A$2,INT((COLUMN()-1)/31.001)+$A$1,ROUNDUP(MOD(COLUMN()-1,31.001),0)),HolidayList[Date],0))),(VLOOKUP(VLOOKUP(WEEKDAY(DATE($A$2,INT((COLUMN()-1)/31.001)+$A$1,ROUNDUP(MOD(COLUMN()-1,31.001),0)),2),Sheet3!$D$1:$E$7,2,0),$NR$11:$NS$17,2,0)=\"Yes\"))","v":true},{"$f":"AND(NOT(ISNUMBER(MATCH(DATE($A$2,INT((COLUMN()-1)/31.001)+$A$1,ROUNDUP(MOD(COLUMN()-1,31.001),0)),HolidayList[Date],0))),(VLOOKUP(VLOOKUP(WEEKDAY(DATE($A$2,INT((COLUMN()-1)/31.001)+$A$1,ROUNDUP(MOD(COLUMN()-1,31.001),0)),2),Sheet3!$D$1:$E$7,2,0),$NR$11:$NS$17,2,0)=\"Yes\"))","v":true},{"$f":"AND(NOT(ISNUMBER(MATCH(DATE($A$2,INT((COLUMN()-1)/31.001)+$A$1,ROUNDUP(MOD(COLUMN()-1,31.001),0)),HolidayList[Date],0))),(VLOOKUP(VLOOKUP(WEEKDAY(DATE($A$2,INT((COLUMN()-1)/31.001)+$A$1,ROUNDUP(MOD(COLUMN()-1,31.001),0)),2),Sheet3!$D$1:$E$7,2,0),$NR$11:$NS$17,2,0)=\"Yes\"))","v":true},{"$f":"AND(NOT(ISNUMBER(MATCH(DATE($A$2,INT((COLUMN()-1)/31.001)+$A$1,ROUNDUP(MOD(COLUMN()-1,31.001),0)),HolidayList[Date],0))),(VLOOKUP(VLOOKUP(WEEKDAY(DATE($A$2,INT((COLUMN()-1)/31.001)+$A$1,ROUNDUP(MOD(COLUMN()-1,31.001),0)),2),Sheet3!$D$1:$E$7,2,0),$NR$11:$NS$17,2,0)=\"Yes\"))","v":true},{"$f":"AND(NOT(ISNUMBER(MATCH(DATE($A$2,INT((COLUMN()-1)/31.001)+$A$1,ROUNDUP(MOD(COLUMN()-1,31.001),0)),HolidayList[Date],0))),(VLOOKUP(VLOOKUP(WEEKDAY(DATE($A$2,INT((COLUMN()-1)/31.001)+$A$1,ROUNDUP(MOD(COLUMN()-1,31.001),0)),2),Sheet3!$D$1:$E$7,2,0),$NR$11:$NS$17,2,0)=\"Yes\"))","v":true},{"$f":"AND(NOT(ISNUMBER(MATCH(DATE($A$2,INT((COLUMN()-1)/31.001)+$A$1,ROUNDUP(MOD(COLUMN()-1,31.001),0)),HolidayList[Date],0))),(VLOOKUP(VLOOKUP(WEEKDAY(DATE($A$2,INT((COLUMN()-1)/31.001)+$A$1,ROUNDUP(MOD(COLUMN()-1,31.001),0)),2),Sheet3!$D$1:$E$7,2,0),$NR$11:$NS$17,2,0)=\"Yes\"))","v":false},{"$f":"AND(NOT(ISNUMBER(MATCH(DATE($A$2,INT((COLUMN()-1)/31.001)+$A$1,ROUNDUP(MOD(COLUMN()-1,31.001),0)),HolidayList[Date],0))),(VLOOKUP(VLOOKUP(WEEKDAY(DATE($A$2,INT((COLUMN()-1)/31.001)+$A$1,ROUNDUP(MOD(COLUMN()-1,31.001),0)),2),Sheet3!$D$1:$E$7,2,0),$NR$11:$NS$17,2,0)=\"Yes\"))","v":false},{"$f":"AND(NOT(ISNUMBER(MATCH(DATE($A$2,INT((COLUMN()-1)/31.001)+$A$1,ROUNDUP(MOD(COLUMN()-1,31.001),0)),HolidayList[Date],0))),(VLOOKUP(VLOOKUP(WEEKDAY(DATE($A$2,INT((COLUMN()-1)/31.001)+$A$1,ROUNDUP(MOD(COLUMN()-1,31.001),0)),2),Sheet3!$D$1:$E$7,2,0),$NR$11:$NS$17,2,0)=\"Yes\"))","v":true},{"$f":"AND(NOT(ISNUMBER(MATCH(DATE($A$2,INT((COLUMN()-1)/31.001)+$A$1,ROUNDUP(MOD(COLUMN()-1,31.001),0)),HolidayList[Date],0))),(VLOOKUP(VLOOKUP(WEEKDAY(DATE($A$2,INT((COLUMN()-1)/31.001)+$A$1,ROUNDUP(MOD(COLUMN()-1,31.001),0)),2),Sheet3!$D$1:$E$7,2,0),$NR$11:$NS$17,2,0)=\"Yes\"))","v":true},{"$f":"AND(NOT(ISNUMBER(MATCH(DATE($A$2,INT((COLUMN()-1)/31.001)+$A$1,ROUNDUP(MOD(COLUMN()-1,31.001),0)),HolidayList[Date],0))),(VLOOKUP(VLOOKUP(WEEKDAY(DATE($A$2,INT((COLUMN()-1)/31.001)+$A$1,ROUNDUP(MOD(COLUMN()-1,31.001),0)),2),Sheet3!$D$1:$E$7,2,0),$NR$11:$NS$17,2,0)=\"Yes\"))","v":true},{"$f":"AND(NOT(ISNUMBER(MATCH(DATE($A$2,INT((COLUMN()-1)/31.001)+$A$1,ROUNDUP(MOD(COLUMN()-1,31.001),0)),HolidayList[Date],0))),(VLOOKUP(VLOOKUP(WEEKDAY(DATE($A$2,INT((COLUMN()-1)/31.001)+$A$1,ROUNDUP(MOD(COLUMN()-1,31.001),0)),2),Sheet3!$D$1:$E$7,2,0),$NR$11:$NS$17,2,0)=\"Yes\"))","v":true},{"$f":"AND(NOT(ISNUMBER(MATCH(DATE($A$2,INT((COLUMN()-1)/31.001)+$A$1,ROUNDUP(MOD(COLUMN()-1,31.001),0)),HolidayList[Date],0))),(VLOOKUP(VLOOKUP(WEEKDAY(DATE($A$2,INT((COLUMN()-1)/31.001)+$A$1,ROUNDUP(MOD(COLUMN()-1,31.001),0)),2),Sheet3!$D$1:$E$7,2,0),$NR$11:$NS$17,2,0)=\"Yes\"))","v":true},{"$f":"AND(NOT(ISNUMBER(MATCH(DATE($A$2,INT((COLUMN()-1)/31.001)+$A$1,ROUNDUP(MOD(COLUMN()-1,31.001),0)),HolidayList[Date],0))),(VLOOKUP(VLOOKUP(WEEKDAY(DATE($A$2,INT((COLUMN()-1)/31.001)+$A$1,ROUNDUP(MOD(COLUMN()-1,31.001),0)),2),Sheet3!$D$1:$E$7,2,0),$NR$11:$NS$17,2,0)=\"Yes\"))","v":false},{"$f":"AND(NOT(ISNUMBER(MATCH(DATE($A$2,INT((COLUMN()-1)/31.001)+$A$1,ROUNDUP(MOD(COLUMN()-1,31.001),0)),HolidayList[Date],0))),(VLOOKUP(VLOOKUP(WEEKDAY(DATE($A$2,INT((COLUMN()-1)/31.001)+$A$1,ROUNDUP(MOD(COLUMN()-1,31.001),0)),2),Sheet3!$D$1:$E$7,2,0),$NR$11:$NS$17,2,0)=\"Yes\"))","v":false},{"$f":"AND(NOT(ISNUMBER(MATCH(DATE($A$2,INT((COLUMN()-1)/31.001)+$A$1,ROUNDUP(MOD(COLUMN()-1,31.001),0)),HolidayList[Date],0))),(VLOOKUP(VLOOKUP(WEEKDAY(DATE($A$2,INT((COLUMN()-1)/31.001)+$A$1,ROUNDUP(MOD(COLUMN()-1,31.001),0)),2),Sheet3!$D$1:$E$7,2,0),$NR$11:$NS$17,2,0)=\"Yes\"))","v":true},{"$f":"AND(NOT(ISNUMBER(MATCH(DATE($A$2,INT((COLUMN()-1)/31.001)+$A$1,ROUNDUP(MOD(COLUMN()-1,31.001),0)),HolidayList[Date],0))),(VLOOKUP(VLOOKUP(WEEKDAY(DATE($A$2,INT((COLUMN()-1)/31.001)+$A$1,ROUNDUP(MOD(COLUMN()-1,31.001),0)),2),Sheet3!$D$1:$E$7,2,0),$NR$11:$NS$17,2,0)=\"Yes\"))","v":true},{"$f":"AND(NOT(ISNUMBER(MATCH(DATE($A$2,INT((COLUMN()-1)/31.001)+$A$1,ROUNDUP(MOD(COLUMN()-1,31.001),0)),HolidayList[Date],0))),(VLOOKUP(VLOOKUP(WEEKDAY(DATE($A$2,INT((COLUMN()-1)/31.001)+$A$1,ROUNDUP(MOD(COLUMN()-1,31.001),0)),2),Sheet3!$D$1:$E$7,2,0),$NR$11:$NS$17,2,0)=\"Yes\"))","v":true},{"$f":"AND(NOT(ISNUMBER(MATCH(DATE($A$2,INT((COLUMN()-1)/31.001)+$A$1,ROUNDUP(MOD(COLUMN()-1,31.001),0)),HolidayList[Date],0))),(VLOOKUP(VLOOKUP(WEEKDAY(DATE($A$2,INT((COLUMN()-1)/31.001)+$A$1,ROUNDUP(MOD(COLUMN()-1,31.001),0)),2),Sheet3!$D$1:$E$7,2,0),$NR$11:$NS$17,2,0)=\"Yes\"))","v":true},{"$f":"AND(NOT(ISNUMBER(MATCH(DATE($A$2,INT((COLUMN()-1)/31.001)+$A$1,ROUNDUP(MOD(COLUMN()-1,31.001),0)),HolidayList[Date],0))),(VLOOKUP(VLOOKUP(WEEKDAY(DATE($A$2,INT((COLUMN()-1)/31.001)+$A$1,ROUNDUP(MOD(COLUMN()-1,31.001),0)),2),Sheet3!$D$1:$E$7,2,0),$NR$11:$NS$17,2,0)=\"Yes\"))","v":true},{"$f":"AND(NOT(ISNUMBER(MATCH(DATE($A$2,INT((COLUMN()-1)/31.001)+$A$1,ROUNDUP(MOD(COLUMN()-1,31.001),0)),HolidayList[Date],0))),(VLOOKUP(VLOOKUP(WEEKDAY(DATE($A$2,INT((COLUMN()-1)/31.001)+$A$1,ROUNDUP(MOD(COLUMN()-1,31.001),0)),2),Sheet3!$D$1:$E$7,2,0),$NR$11:$NS$17,2,0)=\"Yes\"))","v":false},{"$f":"AND(NOT(ISNUMBER(MATCH(DATE($A$2,INT((COLUMN()-1)/31.001)+$A$1,ROUNDUP(MOD(COLUMN()-1,31.001),0)),HolidayList[Date],0))),(VLOOKUP(VLOOKUP(WEEKDAY(DATE($A$2,INT((COLUMN()-1)/31.001)+$A$1,ROUNDUP(MOD(COLUMN()-1,31.001),0)),2),Sheet3!$D$1:$E$7,2,0),$NR$11:$NS$17,2,0)=\"Yes\"))","v":false},{"$f":"AND(NOT(ISNUMBER(MATCH(DATE($A$2,INT((COLUMN()-1)/31.001)+$A$1,ROUNDUP(MOD(COLUMN()-1,31.001),0)),HolidayList[Date],0))),(VLOOKUP(VLOOKUP(WEEKDAY(DATE($A$2,INT((COLUMN()-1)/31.001)+$A$1,ROUNDUP(MOD(COLUMN()-1,31.001),0)),2),Sheet3!$D$1:$E$7,2,0),$NR$11:$NS$17,2,0)=\"Yes\"))","v":false},{"$f":"AND(NOT(ISNUMBER(MATCH(DATE($A$2,INT((COLUMN()-1)/31.001)+$A$1,ROUNDUP(MOD(COLUMN()-1,31.001),0)),HolidayList[Date],0))),(VLOOKUP(VLOOKUP(WEEKDAY(DATE($A$2,INT((COLUMN()-1)/31.001)+$A$1,ROUNDUP(MOD(COLUMN()-1,31.001),0)),2),Sheet3!$D$1:$E$7,2,0),$NR$11:$NS$17,2,0)=\"Yes\"))","v":true},{"$f":"AND(NOT(ISNUMBER(MATCH(DATE($A$2,INT((COLUMN()-1)/31.001)+$A$1,ROUNDUP(MOD(COLUMN()-1,31.001),0)),HolidayList[Date],0))),(VLOOKUP(VLOOKUP(WEEKDAY(DATE($A$2,INT((COLUMN()-1)/31.001)+$A$1,ROUNDUP(MOD(COLUMN()-1,31.001),0)),2),Sheet3!$D$1:$E$7,2,0),$NR$11:$NS$17,2,0)=\"Yes\"))","v":false},{"$f":"AND(NOT(ISNUMBER(MATCH(DATE($A$2,INT((COLUMN()-1)/31.001)+$A$1,ROUNDUP(MOD(COLUMN()-1,31.001),0)),HolidayList[Date],0))),(VLOOKUP(VLOOKUP(WEEKDAY(DATE($A$2,INT((COLUMN()-1)/31.001)+$A$1,ROUNDUP(MOD(COLUMN()-1,31.001),0)),2),Sheet3!$D$1:$E$7,2,0),$NR$11:$NS$17,2,0)=\"Yes\"))","v":true},{"$f":"AND(NOT(ISNUMBER(MATCH(DATE($A$2,INT((COLUMN()-1)/31.001)+$A$1,ROUNDUP(MOD(COLUMN()-1,31.001),0)),HolidayList[Date],0))),(VLOOKUP(VLOOKUP(WEEKDAY(DATE($A$2,INT((COLUMN()-1)/31.001)+$A$1,ROUNDUP(MOD(COLUMN()-1,31.001),0)),2),Sheet3!$D$1:$E$7,2,0),$NR$11:$NS$17,2,0)=\"Yes\"))","v":true},{"$f":"AND(NOT(ISNUMBER(MATCH(DATE($A$2,INT((COLUMN()-1)/31.001)+$A$1,ROUNDUP(MOD(COLUMN()-1,31.001),0)),HolidayList[Date],0))),(VLOOKUP(VLOOKUP(WEEKDAY(DATE($A$2,INT((COLUMN()-1)/31.001)+$A$1,ROUNDUP(MOD(COLUMN()-1,31.001),0)),2),Sheet3!$D$1:$E$7,2,0),$NR$11:$NS$17,2,0)=\"Yes\"))","v":true},{"$f":"AND(NOT(ISNUMBER(MATCH(DATE($A$2,INT((COLUMN()-1)/31.001)+$A$1,ROUNDUP(MOD(COLUMN()-1,31.001),0)),HolidayList[Date],0))),(VLOOKUP(VLOOKUP(WEEKDAY(DATE($A$2,INT((COLUMN()-1)/31.001)+$A$1,ROUNDUP(MOD(COLUMN()-1,31.001),0)),2),Sheet3!$D$1:$E$7,2,0),$NR$11:$NS$17,2,0)=\"Yes\"))","v":false},{"$f":"AND(NOT(ISNUMBER(MATCH(DATE($A$2,INT((COLUMN()-1)/31.001)+$A$1,ROUNDUP(MOD(COLUMN()-1,31.001),0)),HolidayList[Date],0))),(VLOOKUP(VLOOKUP(WEEKDAY(DATE($A$2,INT((COLUMN()-1)/31.001)+$A$1,ROUNDUP(MOD(COLUMN()-1,31.001),0)),2),Sheet3!$D$1:$E$7,2,0),$NR$11:$NS$17,2,0)=\"Yes\"))","v":false},{"$f":"AND(NOT(ISNUMBER(MATCH(DATE($A$2,INT((COLUMN()-1)/31.001)+$A$1,ROUNDUP(MOD(COLUMN()-1,31.001),0)),HolidayList[Date],0))),(VLOOKUP(VLOOKUP(WEEKDAY(DATE($A$2,INT((COLUMN()-1)/31.001)+$A$1,ROUNDUP(MOD(COLUMN()-1,31.001),0)),2),Sheet3!$D$1:$E$7,2,0),$NR$11:$NS$17,2,0)=\"Yes\"))","v":true},{"$f":"AND(NOT(ISNUMBER(MATCH(DATE($A$2,INT((COLUMN()-1)/31.001)+$A$1,ROUNDUP(MOD(COLUMN()-1,31.001),0)),HolidayList[Date],0))),(VLOOKUP(VLOOKUP(WEEKDAY(DATE($A$2,INT((COLUMN()-1)/31.001)+$A$1,ROUNDUP(MOD(COLUMN()-1,31.001),0)),2),Sheet3!$D$1:$E$7,2,0),$NR$11:$NS$17,2,0)=\"Yes\"))","v":true},{"$f":"AND(NOT(ISNUMBER(MATCH(DATE($A$2,INT((COLUMN()-1)/31.001)+$A$1,ROUNDUP(MOD(COLUMN()-1,31.001),0)),HolidayList[Date],0))),(VLOOKUP(VLOOKUP(WEEKDAY(DATE($A$2,INT((COLUMN()-1)/31.001)+$A$1,ROUNDUP(MOD(COLUMN()-1,31.001),0)),2),Sheet3!$D$1:$E$7,2,0),$NR$11:$NS$17,2,0)=\"Yes\"))","v":true},{"$f":"AND(NOT(ISNUMBER(MATCH(DATE($A$2,INT((COLUMN()-1)/31.001)+$A$1,ROUNDUP(MOD(COLUMN()-1,31.001),0)),HolidayList[Date],0))),(VLOOKUP(VLOOKUP(WEEKDAY(DATE($A$2,INT((COLUMN()-1)/31.001)+$A$1,ROUNDUP(MOD(COLUMN()-1,31.001),0)),2),Sheet3!$D$1:$E$7,2,0),$NR$11:$NS$17,2,0)=\"Yes\"))","v":true},{"$f":"AND(NOT(ISNUMBER(MATCH(DATE($A$2,INT((COLUMN()-1)/31.001)+$A$1,ROUNDUP(MOD(COLUMN()-1,31.001),0)),HolidayList[Date],0))),(VLOOKUP(VLOOKUP(WEEKDAY(DATE($A$2,INT((COLUMN()-1)/31.001)+$A$1,ROUNDUP(MOD(COLUMN()-1,31.001),0)),2),Sheet3!$D$1:$E$7,2,0),$NR$11:$NS$17,2,0)=\"Yes\"))","v":true},{"$f":"AND(NOT(ISNUMBER(MATCH(DATE($A$2,INT((COLUMN()-1)/31.001)+$A$1,ROUNDUP(MOD(COLUMN()-1,31.001),0)),HolidayList[Date],0))),(VLOOKUP(VLOOKUP(WEEKDAY(DATE($A$2,INT((COLUMN()-1)/31.001)+$A$1,ROUNDUP(MOD(COLUMN()-1,31.001),0)),2),Sheet3!$D$1:$E$7,2,0),$NR$11:$NS$17,2,0)=\"Yes\"))","v":false},{"$f":"AND(NOT(ISNUMBER(MATCH(DATE($A$2,INT((COLUMN()-1)/31.001)+$A$1,ROUNDUP(MOD(COLUMN()-1,31.001),0)),HolidayList[Date],0))),(VLOOKUP(VLOOKUP(WEEKDAY(DATE($A$2,INT((COLUMN()-1)/31.001)+$A$1,ROUNDUP(MOD(COLUMN()-1,31.001),0)),2),Sheet3!$D$1:$E$7,2,0),$NR$11:$NS$17,2,0)=\"Yes\"))","v":false},{"$f":"AND(NOT(ISNUMBER(MATCH(DATE($A$2,INT((COLUMN()-1)/31.001)+$A$1,ROUNDUP(MOD(COLUMN()-1,31.001),0)),HolidayList[Date],0))),(VLOOKUP(VLOOKUP(WEEKDAY(DATE($A$2,INT((COLUMN()-1)/31.001)+$A$1,ROUNDUP(MOD(COLUMN()-1,31.001),0)),2),Sheet3!$D$1:$E$7,2,0),$NR$11:$NS$17,2,0)=\"Yes\"))","v":true},{"$f":"AND(NOT(ISNUMBER(MATCH(DATE($A$2,INT((COLUMN()-1)/31.001)+$A$1,ROUNDUP(MOD(COLUMN()-1,31.001),0)),HolidayList[Date],0))),(VLOOKUP(VLOOKUP(WEEKDAY(DATE($A$2,INT((COLUMN()-1)/31.001)+$A$1,ROUNDUP(MOD(COLUMN()-1,31.001),0)),2),Sheet3!$D$1:$E$7,2,0),$NR$11:$NS$17,2,0)=\"Yes\"))","v":true},{"$f":"AND(NOT(ISNUMBER(MATCH(DATE($A$2,INT((COLUMN()-1)/31.001)+$A$1,ROUNDUP(MOD(COLUMN()-1,31.001),0)),HolidayList[Date],0))),(VLOOKUP(VLOOKUP(WEEKDAY(DATE($A$2,INT((COLUMN()-1)/31.001)+$A$1,ROUNDUP(MOD(COLUMN()-1,31.001),0)),2),Sheet3!$D$1:$E$7,2,0),$NR$11:$NS$17,2,0)=\"Yes\"))","v":true},{"$f":"AND(NOT(ISNUMBER(MATCH(DATE($A$2,INT((COLUMN()-1)/31.001)+$A$1,ROUNDUP(MOD(COLUMN()-1,31.001),0)),HolidayList[Date],0))),(VLOOKUP(VLOOKUP(WEEKDAY(DATE($A$2,INT((COLUMN()-1)/31.001)+$A$1,ROUNDUP(MOD(COLUMN()-1,31.001),0)),2),Sheet3!$D$1:$E$7,2,0),$NR$11:$NS$17,2,0)=\"Yes\"))","v":true},{"$f":"AND(NOT(ISNUMBER(MATCH(DATE($A$2,INT((COLUMN()-1)/31.001)+$A$1,ROUNDUP(MOD(COLUMN()-1,31.001),0)),HolidayList[Date],0))),(VLOOKUP(VLOOKUP(WEEKDAY(DATE($A$2,INT((COLUMN()-1)/31.001)+$A$1,ROUNDUP(MOD(COLUMN()-1,31.001),0)),2),Sheet3!$D$1:$E$7,2,0),$NR$11:$NS$17,2,0)=\"Yes\"))","v":true},{"$f":"AND(NOT(ISNUMBER(MATCH(DATE($A$2,INT((COLUMN()-1)/31.001)+$A$1,ROUNDUP(MOD(COLUMN()-1,31.001),0)),HolidayList[Date],0))),(VLOOKUP(VLOOKUP(WEEKDAY(DATE($A$2,INT((COLUMN()-1)/31.001)+$A$1,ROUNDUP(MOD(COLUMN()-1,31.001),0)),2),Sheet3!$D$1:$E$7,2,0),$NR$11:$NS$17,2,0)=\"Yes\"))","v":false},{"$f":"AND(NOT(ISNUMBER(MATCH(DATE($A$2,INT((COLUMN()-1)/31.001)+$A$1,ROUNDUP(MOD(COLUMN()-1,31.001),0)),HolidayList[Date],0))),(VLOOKUP(VLOOKUP(WEEKDAY(DATE($A$2,INT((COLUMN()-1)/31.001)+$A$1,ROUNDUP(MOD(COLUMN()-1,31.001),0)),2),Sheet3!$D$1:$E$7,2,0),$NR$11:$NS$17,2,0)=\"Yes\"))","v":false},{"$f":"AND(NOT(ISNUMBER(MATCH(DATE($A$2,INT((COLUMN()-1)/31.001)+$A$1,ROUNDUP(MOD(COLUMN()-1,31.001),0)),HolidayList[Date],0))),(VLOOKUP(VLOOKUP(WEEKDAY(DATE($A$2,INT((COLUMN()-1)/31.001)+$A$1,ROUNDUP(MOD(COLUMN()-1,31.001),0)),2),Sheet3!$D$1:$E$7,2,0),$NR$11:$NS$17,2,0)=\"Yes\"))","v":true},{"$f":"AND(NOT(ISNUMBER(MATCH(DATE($A$2,INT((COLUMN()-1)/31.001)+$A$1,ROUNDUP(MOD(COLUMN()-1,31.001),0)),HolidayList[Date],0))),(VLOOKUP(VLOOKUP(WEEKDAY(DATE($A$2,INT((COLUMN()-1)/31.001)+$A$1,ROUNDUP(MOD(COLUMN()-1,31.001),0)),2),Sheet3!$D$1:$E$7,2,0),$NR$11:$NS$17,2,0)=\"Yes\"))","v":true},{"$f":"AND(NOT(ISNUMBER(MATCH(DATE($A$2,INT((COLUMN()-1)/31.001)+$A$1,ROUNDUP(MOD(COLUMN()-1,31.001),0)),HolidayList[Date],0))),(VLOOKUP(VLOOKUP(WEEKDAY(DATE($A$2,INT((COLUMN()-1)/31.001)+$A$1,ROUNDUP(MOD(COLUMN()-1,31.001),0)),2),Sheet3!$D$1:$E$7,2,0),$NR$11:$NS$17,2,0)=\"Yes\"))","v":true},{"$f":"AND(NOT(ISNUMBER(MATCH(DATE($A$2,INT((COLUMN()-1)/31.001)+$A$1,ROUNDUP(MOD(COLUMN()-1,31.001),0)),HolidayList[Date],0))),(VLOOKUP(VLOOKUP(WEEKDAY(DATE($A$2,INT((COLUMN()-1)/31.001)+$A$1,ROUNDUP(MOD(COLUMN()-1,31.001),0)),2),Sheet3!$D$1:$E$7,2,0),$NR$11:$NS$17,2,0)=\"Yes\"))","v":true},{"$f":"AND(NOT(ISNUMBER(MATCH(DATE($A$2,INT((COLUMN()-1)/31.001)+$A$1,ROUNDUP(MOD(COLUMN()-1,31.001),0)),HolidayList[Date],0))),(VLOOKUP(VLOOKUP(WEEKDAY(DATE($A$2,INT((COLUMN()-1)/31.001)+$A$1,ROUNDUP(MOD(COLUMN()-1,31.001),0)),2),Sheet3!$D$1:$E$7,2,0),$NR$11:$NS$17,2,0)=\"Yes\"))","v":true},{"$f":"AND(NOT(ISNUMBER(MATCH(DATE($A$2,INT((COLUMN()-1)/31.001)+$A$1,ROUNDUP(MOD(COLUMN()-1,31.001),0)),HolidayList[Date],0))),(VLOOKUP(VLOOKUP(WEEKDAY(DATE($A$2,INT((COLUMN()-1)/31.001)+$A$1,ROUNDUP(MOD(COLUMN()-1,31.001),0)),2),Sheet3!$D$1:$E$7,2,0),$NR$11:$NS$17,2,0)=\"Yes\"))","v":false},{"$f":"AND(NOT(ISNUMBER(MATCH(DATE($A$2,INT((COLUMN()-1)/31.001)+$A$1,ROUNDUP(MOD(COLUMN()-1,31.001),0)),HolidayList[Date],0))),(VLOOKUP(VLOOKUP(WEEKDAY(DATE($A$2,INT((COLUMN()-1)/31.001)+$A$1,ROUNDUP(MOD(COLUMN()-1,31.001),0)),2),Sheet3!$D$1:$E$7,2,0),$NR$11:$NS$17,2,0)=\"Yes\"))","v":false},{"$f":"AND(NOT(ISNUMBER(MATCH(DATE($A$2,INT((COLUMN()-1)/31.001)+$A$1,ROUNDUP(MOD(COLUMN()-1,31.001),0)),HolidayList[Date],0))),(VLOOKUP(VLOOKUP(WEEKDAY(DATE($A$2,INT((COLUMN()-1)/31.001)+$A$1,ROUNDUP(MOD(COLUMN()-1,31.001),0)),2),Sheet3!$D$1:$E$7,2,0),$NR$11:$NS$17,2,0)=\"Yes\"))","v":true},{"$f":"AND(NOT(ISNUMBER(MATCH(DATE($A$2,INT((COLUMN()-1)/31.001)+$A$1,ROUNDUP(MOD(COLUMN()-1,31.001),0)),HolidayList[Date],0))),(VLOOKUP(VLOOKUP(WEEKDAY(DATE($A$2,INT((COLUMN()-1)/31.001)+$A$1,ROUNDUP(MOD(COLUMN()-1,31.001),0)),2),Sheet3!$D$1:$E$7,2,0),$NR$11:$NS$17,2,0)=\"Yes\"))","v":true},{"$f":"AND(NOT(ISNUMBER(MATCH(DATE($A$2,INT((COLUMN()-1)/31.001)+$A$1,ROUNDUP(MOD(COLUMN()-1,31.001),0)),HolidayList[Date],0))),(VLOOKUP(VLOOKUP(WEEKDAY(DATE($A$2,INT((COLUMN()-1)/31.001)+$A$1,ROUNDUP(MOD(COLUMN()-1,31.001),0)),2),Sheet3!$D$1:$E$7,2,0),$NR$11:$NS$17,2,0)=\"Yes\"))","v":true},{"$f":"AND(NOT(ISNUMBER(MATCH(DATE($A$2,INT((COLUMN()-1)/31.001)+$A$1,ROUNDUP(MOD(COLUMN()-1,31.001),0)),HolidayList[Date],0))),(VLOOKUP(VLOOKUP(WEEKDAY(DATE($A$2,INT((COLUMN()-1)/31.001)+$A$1,ROUNDUP(MOD(COLUMN()-1,31.001),0)),2),Sheet3!$D$1:$E$7,2,0),$NR$11:$NS$17,2,0)=\"Yes\"))","v":true},{"$f":"AND(NOT(ISNUMBER(MATCH(DATE($A$2,INT((COLUMN()-1)/31.001)+$A$1,ROUNDUP(MOD(COLUMN()-1,31.001),0)),HolidayList[Date],0))),(VLOOKUP(VLOOKUP(WEEKDAY(DATE($A$2,INT((COLUMN()-1)/31.001)+$A$1,ROUNDUP(MOD(COLUMN()-1,31.001),0)),2),Sheet3!$D$1:$E$7,2,0),$NR$11:$NS$17,2,0)=\"Yes\"))","v":true},{"$f":"AND(NOT(ISNUMBER(MATCH(DATE($A$2,INT((COLUMN()-1)/31.001)+$A$1,ROUNDUP(MOD(COLUMN()-1,31.001),0)),HolidayList[Date],0))),(VLOOKUP(VLOOKUP(WEEKDAY(DATE($A$2,INT((COLUMN()-1)/31.001)+$A$1,ROUNDUP(MOD(COLUMN()-1,31.001),0)),2),Sheet3!$D$1:$E$7,2,0),$NR$11:$NS$17,2,0)=\"Yes\"))","v":false},{"$f":"AND(NOT(ISNUMBER(MATCH(DATE($A$2,INT((COLUMN()-1)/31.001)+$A$1,ROUNDUP(MOD(COLUMN()-1,31.001),0)),HolidayList[Date],0))),(VLOOKUP(VLOOKUP(WEEKDAY(DATE($A$2,INT((COLUMN()-1)/31.001)+$A$1,ROUNDUP(MOD(COLUMN()-1,31.001),0)),2),Sheet3!$D$1:$E$7,2,0),$NR$11:$NS$17,2,0)=\"Yes\"))","v":false},{"$f":"AND(NOT(ISNUMBER(MATCH(DATE($A$2,INT((COLUMN()-1)/31.001)+$A$1,ROUNDUP(MOD(COLUMN()-1,31.001),0)),HolidayList[Date],0))),(VLOOKUP(VLOOKUP(WEEKDAY(DATE($A$2,INT((COLUMN()-1)/31.001)+$A$1,ROUNDUP(MOD(COLUMN()-1,31.001),0)),2),Sheet3!$D$1:$E$7,2,0),$NR$11:$NS$17,2,0)=\"Yes\"))","v":true},{"$f":"AND(NOT(ISNUMBER(MATCH(DATE($A$2,INT((COLUMN()-1)/31.001)+$A$1,ROUNDUP(MOD(COLUMN()-1,31.001),0)),HolidayList[Date],0))),(VLOOKUP(VLOOKUP(WEEKDAY(DATE($A$2,INT((COLUMN()-1)/31.001)+$A$1,ROUNDUP(MOD(COLUMN()-1,31.001),0)),2),Sheet3!$D$1:$E$7,2,0),$NR$11:$NS$17,2,0)=\"Yes\"))","v":true},{"$f":"AND(NOT(ISNUMBER(MATCH(DATE($A$2,INT((COLUMN()-1)/31.001)+$A$1,ROUNDUP(MOD(COLUMN()-1,31.001),0)),HolidayList[Date],0))),(VLOOKUP(VLOOKUP(WEEKDAY(DATE($A$2,INT((COLUMN()-1)/31.001)+$A$1,ROUNDUP(MOD(COLUMN()-1,31.001),0)),2),Sheet3!$D$1:$E$7,2,0),$NR$11:$NS$17,2,0)=\"Yes\"))","v":true},{"$f":"AND(NOT(ISNUMBER(MATCH(DATE($A$2,INT((COLUMN()-1)/31.001)+$A$1,ROUNDUP(MOD(COLUMN()-1,31.001),0)),HolidayList[Date],0))),(VLOOKUP(VLOOKUP(WEEKDAY(DATE($A$2,INT((COLUMN()-1)/31.001)+$A$1,ROUNDUP(MOD(COLUMN()-1,31.001),0)),2),Sheet3!$D$1:$E$7,2,0),$NR$11:$NS$17,2,0)=\"Yes\"))","v":true},{"$f":"AND(NOT(ISNUMBER(MATCH(DATE($A$2,INT((COLUMN()-1)/31.001)+$A$1,ROUNDUP(MOD(COLUMN()-1,31.001),0)),HolidayList[Date],0))),(VLOOKUP(VLOOKUP(WEEKDAY(DATE($A$2,INT((COLUMN()-1)/31.001)+$A$1,ROUNDUP(MOD(COLUMN()-1,31.001),0)),2),Sheet3!$D$1:$E$7,2,0),$NR$11:$NS$17,2,0)=\"Yes\"))","v":true},{"$f":"AND(NOT(ISNUMBER(MATCH(DATE($A$2,INT((COLUMN()-1)/31.001)+$A$1,ROUNDUP(MOD(COLUMN()-1,31.001),0)),HolidayList[Date],0))),(VLOOKUP(VLOOKUP(WEEKDAY(DATE($A$2,INT((COLUMN()-1)/31.001)+$A$1,ROUNDUP(MOD(COLUMN()-1,31.001),0)),2),Sheet3!$D$1:$E$7,2,0),$NR$11:$NS$17,2,0)=\"Yes\"))","v":false},{"$f":"AND(NOT(ISNUMBER(MATCH(DATE($A$2,INT((COLUMN()-1)/31.001)+$A$1,ROUNDUP(MOD(COLUMN()-1,31.001),0)),HolidayList[Date],0))),(VLOOKUP(VLOOKUP(WEEKDAY(DATE($A$2,INT((COLUMN()-1)/31.001)+$A$1,ROUNDUP(MOD(COLUMN()-1,31.001),0)),2),Sheet3!$D$1:$E$7,2,0),$NR$11:$NS$17,2,0)=\"Yes\"))","v":false},{"$f":"AND(NOT(ISNUMBER(MATCH(DATE($A$2,INT((COLUMN()-1)/31.001)+$A$1,ROUNDUP(MOD(COLUMN()-1,31.001),0)),HolidayList[Date],0))),(VLOOKUP(VLOOKUP(WEEKDAY(DATE($A$2,INT((COLUMN()-1)/31.001)+$A$1,ROUNDUP(MOD(COLUMN()-1,31.001),0)),2),Sheet3!$D$1:$E$7,2,0),$NR$11:$NS$17,2,0)=\"Yes\"))","v":true},{"$f":"AND(NOT(ISNUMBER(MATCH(DATE($A$2,INT((COLUMN()-1)/31.001)+$A$1,ROUNDUP(MOD(COLUMN()-1,31.001),0)),HolidayList[Date],0))),(VLOOKUP(VLOOKUP(WEEKDAY(DATE($A$2,INT((COLUMN()-1)/31.001)+$A$1,ROUNDUP(MOD(COLUMN()-1,31.001),0)),2),Sheet3!$D$1:$E$7,2,0),$NR$11:$NS$17,2,0)=\"Yes\"))","v":true},{"$f":"AND(NOT(ISNUMBER(MATCH(DATE($A$2,INT((COLUMN()-1)/31.001)+$A$1,ROUNDUP(MOD(COLUMN()-1,31.001),0)),HolidayList[Date],0))),(VLOOKUP(VLOOKUP(WEEKDAY(DATE($A$2,INT((COLUMN()-1)/31.001)+$A$1,ROUNDUP(MOD(COLUMN()-1,31.001),0)),2),Sheet3!$D$1:$E$7,2,0),$NR$11:$NS$17,2,0)=\"Yes\"))","v":true},{"$f":"AND(NOT(ISNUMBER(MATCH(DATE($A$2,INT((COLUMN()-1)/31.001)+$A$1,ROUNDUP(MOD(COLUMN()-1,31.001),0)),HolidayList[Date],0))),(VLOOKUP(VLOOKUP(WEEKDAY(DATE($A$2,INT((COLUMN()-1)/31.001)+$A$1,ROUNDUP(MOD(COLUMN()-1,31.001),0)),2),Sheet3!$D$1:$E$7,2,0),$NR$11:$NS$17,2,0)=\"Yes\"))","v":true},{"$f":"AND(NOT(ISNUMBER(MATCH(DATE($A$2,INT((COLUMN()-1)/31.001)+$A$1,ROUNDUP(MOD(COLUMN()-1,31.001),0)),HolidayList[Date],0))),(VLOOKUP(VLOOKUP(WEEKDAY(DATE($A$2,INT((COLUMN()-1)/31.001)+$A$1,ROUNDUP(MOD(COLUMN()-1,31.001),0)),2),Sheet3!$D$1:$E$7,2,0),$NR$11:$NS$17,2,0)=\"Yes\"))","v":true},{"$f":"AND(NOT(ISNUMBER(MATCH(DATE($A$2,INT((COLUMN()-1)/31.001)+$A$1,ROUNDUP(MOD(COLUMN()-1,31.001),0)),HolidayList[Date],0))),(VLOOKUP(VLOOKUP(WEEKDAY(DATE($A$2,INT((COLUMN()-1)/31.001)+$A$1,ROUNDUP(MOD(COLUMN()-1,31.001),0)),2),Sheet3!$D$1:$E$7,2,0),$NR$11:$NS$17,2,0)=\"Yes\"))","v":false},{"$f":"AND(NOT(ISNUMBER(MATCH(DATE($A$2,INT((COLUMN()-1)/31.001)+$A$1,ROUNDUP(MOD(COLUMN()-1,31.001),0)),HolidayList[Date],0))),(VLOOKUP(VLOOKUP(WEEKDAY(DATE($A$2,INT((COLUMN()-1)/31.001)+$A$1,ROUNDUP(MOD(COLUMN()-1,31.001),0)),2),Sheet3!$D$1:$E$7,2,0),$NR$11:$NS$17,2,0)=\"Yes\"))","v":false},{"$f":"AND(NOT(ISNUMBER(MATCH(DATE($A$2,INT((COLUMN()-1)/31.001)+$A$1,ROUNDUP(MOD(COLUMN()-1,31.001),0)),HolidayList[Date],0))),(VLOOKUP(VLOOKUP(WEEKDAY(DATE($A$2,INT((COLUMN()-1)/31.001)+$A$1,ROUNDUP(MOD(COLUMN()-1,31.001),0)),2),Sheet3!$D$1:$E$7,2,0),$NR$11:$NS$17,2,0)=\"Yes\"))","v":true},{"$f":"AND(NOT(ISNUMBER(MATCH(DATE($A$2,INT((COLUMN()-1)/31.001)+$A$1,ROUNDUP(MOD(COLUMN()-1,31.001),0)),HolidayList[Date],0))),(VLOOKUP(VLOOKUP(WEEKDAY(DATE($A$2,INT((COLUMN()-1)/31.001)+$A$1,ROUNDUP(MOD(COLUMN()-1,31.001),0)),2),Sheet3!$D$1:$E$7,2,0),$NR$11:$NS$17,2,0)=\"Yes\"))","v":true},{"$f":"AND(NOT(ISNUMBER(MATCH(DATE($A$2,INT((COLUMN()-1)/31.001)+$A$1,ROUNDUP(MOD(COLUMN()-1,31.001),0)),HolidayList[Date],0))),(VLOOKUP(VLOOKUP(WEEKDAY(DATE($A$2,INT((COLUMN()-1)/31.001)+$A$1,ROUNDUP(MOD(COLUMN()-1,31.001),0)),2),Sheet3!$D$1:$E$7,2,0),$NR$11:$NS$17,2,0)=\"Yes\"))","v":true},{"$f":"AND(NOT(ISNUMBER(MATCH(DATE($A$2,INT((COLUMN()-1)/31.001)+$A$1,ROUNDUP(MOD(COLUMN()-1,31.001),0)),HolidayList[Date],0))),(VLOOKUP(VLOOKUP(WEEKDAY(DATE($A$2,INT((COLUMN()-1)/31.001)+$A$1,ROUNDUP(MOD(COLUMN()-1,31.001),0)),2),Sheet3!$D$1:$E$7,2,0),$NR$11:$NS$17,2,0)=\"Yes\"))","v":true},{"$f":"AND(NOT(ISNUMBER(MATCH(DATE($A$2,INT((COLUMN()-1)/31.001)+$A$1,ROUNDUP(MOD(COLUMN()-1,31.001),0)),HolidayList[Date],0))),(VLOOKUP(VLOOKUP(WEEKDAY(DATE($A$2,INT((COLUMN()-1)/31.001)+$A$1,ROUNDUP(MOD(COLUMN()-1,31.001),0)),2),Sheet3!$D$1:$E$7,2,0),$NR$11:$NS$17,2,0)=\"Yes\"))","v":true},{"$f":"AND(NOT(ISNUMBER(MATCH(DATE($A$2,INT((COLUMN()-1)/31.001)+$A$1,ROUNDUP(MOD(COLUMN()-1,31.001),0)),HolidayList[Date],0))),(VLOOKUP(VLOOKUP(WEEKDAY(DATE($A$2,INT((COLUMN()-1)/31.001)+$A$1,ROUNDUP(MOD(COLUMN()-1,31.001),0)),2),Sheet3!$D$1:$E$7,2,0),$NR$11:$NS$17,2,0)=\"Yes\"))","v":false},{"$f":"AND(NOT(ISNUMBER(MATCH(DATE($A$2,INT((COLUMN()-1)/31.001)+$A$1,ROUNDUP(MOD(COLUMN()-1,31.001),0)),HolidayList[Date],0))),(VLOOKUP(VLOOKUP(WEEKDAY(DATE($A$2,INT((COLUMN()-1)/31.001)+$A$1,ROUNDUP(MOD(COLUMN()-1,31.001),0)),2),Sheet3!$D$1:$E$7,2,0),$NR$11:$NS$17,2,0)=\"Yes\"))","v":false},{"$f":"AND(NOT(ISNUMBER(MATCH(DATE($A$2,INT((COLUMN()-1)/31.001)+$A$1,ROUNDUP(MOD(COLUMN()-1,31.001),0)),HolidayList[Date],0))),(VLOOKUP(VLOOKUP(WEEKDAY(DATE($A$2,INT((COLUMN()-1)/31.001)+$A$1,ROUNDUP(MOD(COLUMN()-1,31.001),0)),2),Sheet3!$D$1:$E$7,2,0),$NR$11:$NS$17,2,0)=\"Yes\"))","v":true},{"$f":"AND(NOT(ISNUMBER(MATCH(DATE($A$2,INT((COLUMN()-1)/31.001)+$A$1,ROUNDUP(MOD(COLUMN()-1,31.001),0)),HolidayList[Date],0))),(VLOOKUP(VLOOKUP(WEEKDAY(DATE($A$2,INT((COLUMN()-1)/31.001)+$A$1,ROUNDUP(MOD(COLUMN()-1,31.001),0)),2),Sheet3!$D$1:$E$7,2,0),$NR$11:$NS$17,2,0)=\"Yes\"))","v":true},{"$f":"AND(NOT(ISNUMBER(MATCH(DATE($A$2,INT((COLUMN()-1)/31.001)+$A$1,ROUNDUP(MOD(COLUMN()-1,31.001),0)),HolidayList[Date],0))),(VLOOKUP(VLOOKUP(WEEKDAY(DATE($A$2,INT((COLUMN()-1)/31.001)+$A$1,ROUNDUP(MOD(COLUMN()-1,31.001),0)),2),Sheet3!$D$1:$E$7,2,0),$NR$11:$NS$17,2,0)=\"Yes\"))","v":true},{"$f":"AND(NOT(ISNUMBER(MATCH(DATE($A$2,INT((COLUMN()-1)/31.001)+$A$1,ROUNDUP(MOD(COLUMN()-1,31.001),0)),HolidayList[Date],0))),(VLOOKUP(VLOOKUP(WEEKDAY(DATE($A$2,INT((COLUMN()-1)/31.001)+$A$1,ROUNDUP(MOD(COLUMN()-1,31.001),0)),2),Sheet3!$D$1:$E$7,2,0),$NR$11:$NS$17,2,0)=\"Yes\"))","v":true},{"$f":"AND(NOT(ISNUMBER(MATCH(DATE($A$2,INT((COLUMN()-1)/31.001)+$A$1,ROUNDUP(MOD(COLUMN()-1,31.001),0)),HolidayList[Date],0))),(VLOOKUP(VLOOKUP(WEEKDAY(DATE($A$2,INT((COLUMN()-1)/31.001)+$A$1,ROUNDUP(MOD(COLUMN()-1,31.001),0)),2),Sheet3!$D$1:$E$7,2,0),$NR$11:$NS$17,2,0)=\"Yes\"))","v":true},{"$f":"AND(NOT(ISNUMBER(MATCH(DATE($A$2,INT((COLUMN()-1)/31.001)+$A$1,ROUNDUP(MOD(COLUMN()-1,31.001),0)),HolidayList[Date],0))),(VLOOKUP(VLOOKUP(WEEKDAY(DATE($A$2,INT((COLUMN()-1)/31.001)+$A$1,ROUNDUP(MOD(COLUMN()-1,31.001),0)),2),Sheet3!$D$1:$E$7,2,0),$NR$11:$NS$17,2,0)=\"Yes\"))","v":false},{"$f":"AND(NOT(ISNUMBER(MATCH(DATE($A$2,INT((COLUMN()-1)/31.001)+$A$1,ROUNDUP(MOD(COLUMN()-1,31.001),0)),HolidayList[Date],0))),(VLOOKUP(VLOOKUP(WEEKDAY(DATE($A$2,INT((COLUMN()-1)/31.001)+$A$1,ROUNDUP(MOD(COLUMN()-1,31.001),0)),2),Sheet3!$D$1:$E$7,2,0),$NR$11:$NS$17,2,0)=\"Yes\"))","v":false},{"$f":"AND(NOT(ISNUMBER(MATCH(DATE($A$2,INT((COLUMN()-1)/31.001)+$A$1,ROUNDUP(MOD(COLUMN()-1,31.001),0)),HolidayList[Date],0))),(VLOOKUP(VLOOKUP(WEEKDAY(DATE($A$2,INT((COLUMN()-1)/31.001)+$A$1,ROUNDUP(MOD(COLUMN()-1,31.001),0)),2),Sheet3!$D$1:$E$7,2,0),$NR$11:$NS$17,2,0)=\"Yes\"))","v":true},{"$f":"AND(NOT(ISNUMBER(MATCH(DATE($A$2,INT((COLUMN()-1)/31.001)+$A$1,ROUNDUP(MOD(COLUMN()-1,31.001),0)),HolidayList[Date],0))),(VLOOKUP(VLOOKUP(WEEKDAY(DATE($A$2,INT((COLUMN()-1)/31.001)+$A$1,ROUNDUP(MOD(COLUMN()-1,31.001),0)),2),Sheet3!$D$1:$E$7,2,0),$NR$11:$NS$17,2,0)=\"Yes\"))","v":false},{"$f":"AND(NOT(ISNUMBER(MATCH(DATE($A$2,INT((COLUMN()-1)/31.001)+$A$1,ROUNDUP(MOD(COLUMN()-1,31.001),0)),HolidayList[Date],0))),(VLOOKUP(VLOOKUP(WEEKDAY(DATE($A$2,INT((COLUMN()-1)/31.001)+$A$1,ROUNDUP(MOD(COLUMN()-1,31.001),0)),2),Sheet3!$D$1:$E$7,2,0),$NR$11:$NS$17,2,0)=\"Yes\"))","v":true},{"$f":"AND(NOT(ISNUMBER(MATCH(DATE($A$2,INT((COLUMN()-1)/31.001)+$A$1,ROUNDUP(MOD(COLUMN()-1,31.001),0)),HolidayList[Date],0))),(VLOOKUP(VLOOKUP(WEEKDAY(DATE($A$2,INT((COLUMN()-1)/31.001)+$A$1,ROUNDUP(MOD(COLUMN()-1,31.001),0)),2),Sheet3!$D$1:$E$7,2,0),$NR$11:$NS$17,2,0)=\"Yes\"))","v":true},{"$f":"AND(NOT(ISNUMBER(MATCH(DATE($A$2,INT((COLUMN()-1)/31.001)+$A$1,ROUNDUP(MOD(COLUMN()-1,31.001),0)),HolidayList[Date],0))),(VLOOKUP(VLOOKUP(WEEKDAY(DATE($A$2,INT((COLUMN()-1)/31.001)+$A$1,ROUNDUP(MOD(COLUMN()-1,31.001),0)),2),Sheet3!$D$1:$E$7,2,0),$NR$11:$NS$17,2,0)=\"Yes\"))","v":true},{"$f":"AND(NOT(ISNUMBER(MATCH(DATE($A$2,INT((COLUMN()-1)/31.001)+$A$1,ROUNDUP(MOD(COLUMN()-1,31.001),0)),HolidayList[Date],0))),(VLOOKUP(VLOOKUP(WEEKDAY(DATE($A$2,INT((COLUMN()-1)/31.001)+$A$1,ROUNDUP(MOD(COLUMN()-1,31.001),0)),2),Sheet3!$D$1:$E$7,2,0),$NR$11:$NS$17,2,0)=\"Yes\"))","v":false},{"$f":"AND(NOT(ISNUMBER(MATCH(DATE($A$2,INT((COLUMN()-1)/31.001)+$A$1,ROUNDUP(MOD(COLUMN()-1,31.001),0)),HolidayList[Date],0))),(VLOOKUP(VLOOKUP(WEEKDAY(DATE($A$2,INT((COLUMN()-1)/31.001)+$A$1,ROUNDUP(MOD(COLUMN()-1,31.001),0)),2),Sheet3!$D$1:$E$7,2,0),$NR$11:$NS$17,2,0)=\"Yes\"))","v":false},{"$f":"AND(NOT(ISNUMBER(MATCH(DATE($A$2,INT((COLUMN()-1)/31.001)+$A$1,ROUNDUP(MOD(COLUMN()-1,31.001),0)),HolidayList[Date],0))),(VLOOKUP(VLOOKUP(WEEKDAY(DATE($A$2,INT((COLUMN()-1)/31.001)+$A$1,ROUNDUP(MOD(COLUMN()-1,31.001),0)),2),Sheet3!$D$1:$E$7,2,0),$NR$11:$NS$17,2,0)=\"Yes\"))","v":true},{"$f":"AND(NOT(ISNUMBER(MATCH(DATE($A$2,INT((COLUMN()-1)/31.001)+$A$1,ROUNDUP(MOD(COLUMN()-1,31.001),0)),HolidayList[Date],0))),(VLOOKUP(VLOOKUP(WEEKDAY(DATE($A$2,INT((COLUMN()-1)/31.001)+$A$1,ROUNDUP(MOD(COLUMN()-1,31.001),0)),2),Sheet3!$D$1:$E$7,2,0),$NR$11:$NS$17,2,0)=\"Yes\"))","v":true},{"$f":"AND(NOT(ISNUMBER(MATCH(DATE($A$2,INT((COLUMN()-1)/31.001)+$A$1,ROUNDUP(MOD(COLUMN()-1,31.001),0)),HolidayList[Date],0))),(VLOOKUP(VLOOKUP(WEEKDAY(DATE($A$2,INT((COLUMN()-1)/31.001)+$A$1,ROUNDUP(MOD(COLUMN()-1,31.001),0)),2),Sheet3!$D$1:$E$7,2,0),$NR$11:$NS$17,2,0)=\"Yes\"))","v":true},{"$f":"AND(NOT(ISNUMBER(MATCH(DATE($A$2,INT((COLUMN()-1)/31.001)+$A$1,ROUNDUP(MOD(COLUMN()-1,31.001),0)),HolidayList[Date],0))),(VLOOKUP(VLOOKUP(WEEKDAY(DATE($A$2,INT((COLUMN()-1)/31.001)+$A$1,ROUNDUP(MOD(COLUMN()-1,31.001),0)),2),Sheet3!$D$1:$E$7,2,0),$NR$11:$NS$17,2,0)=\"Yes\"))","v":true},{"$f":"AND(NOT(ISNUMBER(MATCH(DATE($A$2,INT((COLUMN()-1)/31.001)+$A$1,ROUNDUP(MOD(COLUMN()-1,31.001),0)),HolidayList[Date],0))),(VLOOKUP(VLOOKUP(WEEKDAY(DATE($A$2,INT((COLUMN()-1)/31.001)+$A$1,ROUNDUP(MOD(COLUMN()-1,31.001),0)),2),Sheet3!$D$1:$E$7,2,0),$NR$11:$NS$17,2,0)=\"Yes\"))","v":true},{"$f":"AND(NOT(ISNUMBER(MATCH(DATE($A$2,INT((COLUMN()-1)/31.001)+$A$1,ROUNDUP(MOD(COLUMN()-1,31.001),0)),HolidayList[Date],0))),(VLOOKUP(VLOOKUP(WEEKDAY(DATE($A$2,INT((COLUMN()-1)/31.001)+$A$1,ROUNDUP(MOD(COLUMN()-1,31.001),0)),2),Sheet3!$D$1:$E$7,2,0),$NR$11:$NS$17,2,0)=\"Yes\"))","v":false},{"$f":"AND(NOT(ISNUMBER(MATCH(DATE($A$2,INT((COLUMN()-1)/31.001)+$A$1,ROUNDUP(MOD(COLUMN()-1,31.001),0)),HolidayList[Date],0))),(VLOOKUP(VLOOKUP(WEEKDAY(DATE($A$2,INT((COLUMN()-1)/31.001)+$A$1,ROUNDUP(MOD(COLUMN()-1,31.001),0)),2),Sheet3!$D$1:$E$7,2,0),$NR$11:$NS$17,2,0)=\"Yes\"))","v":false},{"$f":"AND(NOT(ISNUMBER(MATCH(DATE($A$2,INT((COLUMN()-1)/31.001)+$A$1,ROUNDUP(MOD(COLUMN()-1,31.001),0)),HolidayList[Date],0))),(VLOOKUP(VLOOKUP(WEEKDAY(DATE($A$2,INT((COLUMN()-1)/31.001)+$A$1,ROUNDUP(MOD(COLUMN()-1,31.001),0)),2),Sheet3!$D$1:$E$7,2,0),$NR$11:$NS$17,2,0)=\"Yes\"))","v":true},{"$f":"AND(NOT(ISNUMBER(MATCH(DATE($A$2,INT((COLUMN()-1)/31.001)+$A$1,ROUNDUP(MOD(COLUMN()-1,31.001),0)),HolidayList[Date],0))),(VLOOKUP(VLOOKUP(WEEKDAY(DATE($A$2,INT((COLUMN()-1)/31.001)+$A$1,ROUNDUP(MOD(COLUMN()-1,31.001),0)),2),Sheet3!$D$1:$E$7,2,0),$NR$11:$NS$17,2,0)=\"Yes\"))","v":true},{"$f":"AND(NOT(ISNUMBER(MATCH(DATE($A$2,INT((COLUMN()-1)/31.001)+$A$1,ROUNDUP(MOD(COLUMN()-1,31.001),0)),HolidayList[Date],0))),(VLOOKUP(VLOOKUP(WEEKDAY(DATE($A$2,INT((COLUMN()-1)/31.001)+$A$1,ROUNDUP(MOD(COLUMN()-1,31.001),0)),2),Sheet3!$D$1:$E$7,2,0),$NR$11:$NS$17,2,0)=\"Yes\"))","v":true},{"$f":"AND(NOT(ISNUMBER(MATCH(DATE($A$2,INT((COLUMN()-1)/31.001)+$A$1,ROUNDUP(MOD(COLUMN()-1,31.001),0)),HolidayList[Date],0))),(VLOOKUP(VLOOKUP(WEEKDAY(DATE($A$2,INT((COLUMN()-1)/31.001)+$A$1,ROUNDUP(MOD(COLUMN()-1,31.001),0)),2),Sheet3!$D$1:$E$7,2,0),$NR$11:$NS$17,2,0)=\"Yes\"))","v":true},{"$f":"AND(NOT(ISNUMBER(MATCH(DATE($A$2,INT((COLUMN()-1)/31.001)+$A$1,ROUNDUP(MOD(COLUMN()-1,31.001),0)),HolidayList[Date],0))),(VLOOKUP(VLOOKUP(WEEKDAY(DATE($A$2,INT((COLUMN()-1)/31.001)+$A$1,ROUNDUP(MOD(COLUMN()-1,31.001),0)),2),Sheet3!$D$1:$E$7,2,0),$NR$11:$NS$17,2,0)=\"Yes\"))","v":true},{"$f":"AND(NOT(ISNUMBER(MATCH(DATE($A$2,INT((COLUMN()-1)/31.001)+$A$1,ROUNDUP(MOD(COLUMN()-1,31.001),0)),HolidayList[Date],0))),(VLOOKUP(VLOOKUP(WEEKDAY(DATE($A$2,INT((COLUMN()-1)/31.001)+$A$1,ROUNDUP(MOD(COLUMN()-1,31.001),0)),2),Sheet3!$D$1:$E$7,2,0),$NR$11:$NS$17,2,0)=\"Yes\"))","v":false},{"$f":"AND(NOT(ISNUMBER(MATCH(DATE($A$2,INT((COLUMN()-1)/31.001)+$A$1,ROUNDUP(MOD(COLUMN()-1,31.001),0)),HolidayList[Date],0))),(VLOOKUP(VLOOKUP(WEEKDAY(DATE($A$2,INT((COLUMN()-1)/31.001)+$A$1,ROUNDUP(MOD(COLUMN()-1,31.001),0)),2),Sheet3!$D$1:$E$7,2,0),$NR$11:$NS$17,2,0)=\"Yes\"))","v":false},{"$f":"AND(NOT(ISNUMBER(MATCH(DATE($A$2,INT((COLUMN()-1)/31.001)+$A$1,ROUNDUP(MOD(COLUMN()-1,31.001),0)),HolidayList[Date],0))),(VLOOKUP(VLOOKUP(WEEKDAY(DATE($A$2,INT((COLUMN()-1)/31.001)+$A$1,ROUNDUP(MOD(COLUMN()-1,31.001),0)),2),Sheet3!$D$1:$E$7,2,0),$NR$11:$NS$17,2,0)=\"Yes\"))","v":true},{"$f":"AND(NOT(ISNUMBER(MATCH(DATE($A$2,INT((COLUMN()-1)/31.001)+$A$1,ROUNDUP(MOD(COLUMN()-1,31.001),0)),HolidayList[Date],0))),(VLOOKUP(VLOOKUP(WEEKDAY(DATE($A$2,INT((COLUMN()-1)/31.001)+$A$1,ROUNDUP(MOD(COLUMN()-1,31.001),0)),2),Sheet3!$D$1:$E$7,2,0),$NR$11:$NS$17,2,0)=\"Yes\"))","v":true},{"$f":"AND(NOT(ISNUMBER(MATCH(DATE($A$2,INT((COLUMN()-1)/31.001)+$A$1,ROUNDUP(MOD(COLUMN()-1,31.001),0)),HolidayList[Date],0))),(VLOOKUP(VLOOKUP(WEEKDAY(DATE($A$2,INT((COLUMN()-1)/31.001)+$A$1,ROUNDUP(MOD(COLUMN()-1,31.001),0)),2),Sheet3!$D$1:$E$7,2,0),$NR$11:$NS$17,2,0)=\"Yes\"))","v":true},{"$f":"AND(NOT(ISNUMBER(MATCH(DATE($A$2,INT((COLUMN()-1)/31.001)+$A$1,ROUNDUP(MOD(COLUMN()-1,31.001),0)),HolidayList[Date],0))),(VLOOKUP(VLOOKUP(WEEKDAY(DATE($A$2,INT((COLUMN()-1)/31.001)+$A$1,ROUNDUP(MOD(COLUMN()-1,31.001),0)),2),Sheet3!$D$1:$E$7,2,0),$NR$11:$NS$17,2,0)=\"Yes\"))","v":true},{"$f":"AND(NOT(ISNUMBER(MATCH(DATE($A$2,INT((COLUMN()-1)/31.001)+$A$1,ROUNDUP(MOD(COLUMN()-1,31.001),0)),HolidayList[Date],0))),(VLOOKUP(VLOOKUP(WEEKDAY(DATE($A$2,INT((COLUMN()-1)/31.001)+$A$1,ROUNDUP(MOD(COLUMN()-1,31.001),0)),2),Sheet3!$D$1:$E$7,2,0),$NR$11:$NS$17,2,0)=\"Yes\"))","v":true},{"$f":"AND(NOT(ISNUMBER(MATCH(DATE($A$2,INT((COLUMN()-1)/31.001)+$A$1,ROUNDUP(MOD(COLUMN()-1,31.001),0)),HolidayList[Date],0))),(VLOOKUP(VLOOKUP(WEEKDAY(DATE($A$2,INT((COLUMN()-1)/31.001)+$A$1,ROUNDUP(MOD(COLUMN()-1,31.001),0)),2),Sheet3!$D$1:$E$7,2,0),$NR$11:$NS$17,2,0)=\"Yes\"))","v":false},{"$f":"AND(NOT(ISNUMBER(MATCH(DATE($A$2,INT((COLUMN()-1)/31.001)+$A$1,ROUNDUP(MOD(COLUMN()-1,31.001),0)),HolidayList[Date],0))),(VLOOKUP(VLOOKUP(WEEKDAY(DATE($A$2,INT((COLUMN()-1)/31.001)+$A$1,ROUNDUP(MOD(COLUMN()-1,31.001),0)),2),Sheet3!$D$1:$E$7,2,0),$NR$11:$NS$17,2,0)=\"Yes\"))","v":false},{"$f":"AND(NOT(ISNUMBER(MATCH(DATE($A$2,INT((COLUMN()-1)/31.001)+$A$1,ROUNDUP(MOD(COLUMN()-1,31.001),0)),HolidayList[Date],0))),(VLOOKUP(VLOOKUP(WEEKDAY(DATE($A$2,INT((COLUMN()-1)/31.001)+$A$1,ROUNDUP(MOD(COLUMN()-1,31.001),0)),2),Sheet3!$D$1:$E$7,2,0),$NR$11:$NS$17,2,0)=\"Yes\"))","v":false},{"$f":"AND(NOT(ISNUMBER(MATCH(DATE($A$2,INT((COLUMN()-1)/31.001)+$A$1,ROUNDUP(MOD(COLUMN()-1,31.001),0)),HolidayList[Date],0))),(VLOOKUP(VLOOKUP(WEEKDAY(DATE($A$2,INT((COLUMN()-1)/31.001)+$A$1,ROUNDUP(MOD(COLUMN()-1,31.001),0)),2),Sheet3!$D$1:$E$7,2,0),$NR$11:$NS$17,2,0)=\"Yes\"))","v":true},{"$f":"AND(NOT(ISNUMBER(MATCH(DATE($A$2,INT((COLUMN()-1)/31.001)+$A$1,ROUNDUP(MOD(COLUMN()-1,31.001),0)),HolidayList[Date],0))),(VLOOKUP(VLOOKUP(WEEKDAY(DATE($A$2,INT((COLUMN()-1)/31.001)+$A$1,ROUNDUP(MOD(COLUMN()-1,31.001),0)),2),Sheet3!$D$1:$E$7,2,0),$NR$11:$NS$17,2,0)=\"Yes\"))","v":true},{"$f":"AND(NOT(ISNUMBER(MATCH(DATE($A$2,INT((COLUMN()-1)/31.001)+$A$1,ROUNDUP(MOD(COLUMN()-1,31.001),0)),HolidayList[Date],0))),(VLOOKUP(VLOOKUP(WEEKDAY(DATE($A$2,INT((COLUMN()-1)/31.001)+$A$1,ROUNDUP(MOD(COLUMN()-1,31.001),0)),2),Sheet3!$D$1:$E$7,2,0),$NR$11:$NS$17,2,0)=\"Yes\"))","v":true},{"$f":"AND(NOT(ISNUMBER(MATCH(DATE($A$2,INT((COLUMN()-1)/31.001)+$A$1,ROUNDUP(MOD(COLUMN()-1,31.001),0)),HolidayList[Date],0))),(VLOOKUP(VLOOKUP(WEEKDAY(DATE($A$2,INT((COLUMN()-1)/31.001)+$A$1,ROUNDUP(MOD(COLUMN()-1,31.001),0)),2),Sheet3!$D$1:$E$7,2,0),$NR$11:$NS$17,2,0)=\"Yes\"))","v":true},{"$f":"AND(NOT(ISNUMBER(MATCH(DATE($A$2,INT((COLUMN()-1)/31.001)+$A$1,ROUNDUP(MOD(COLUMN()-1,31.001),0)),HolidayList[Date],0))),(VLOOKUP(VLOOKUP(WEEKDAY(DATE($A$2,INT((COLUMN()-1)/31.001)+$A$1,ROUNDUP(MOD(COLUMN()-1,31.001),0)),2),Sheet3!$D$1:$E$7,2,0),$NR$11:$NS$17,2,0)=\"Yes\"))","v":true},{"$f":"AND(NOT(ISNUMBER(MATCH(DATE($A$2,INT((COLUMN()-1)/31.001)+$A$1,ROUNDUP(MOD(COLUMN()-1,31.001),0)),HolidayList[Date],0))),(VLOOKUP(VLOOKUP(WEEKDAY(DATE($A$2,INT((COLUMN()-1)/31.001)+$A$1,ROUNDUP(MOD(COLUMN()-1,31.001),0)),2),Sheet3!$D$1:$E$7,2,0),$NR$11:$NS$17,2,0)=\"Yes\"))","v":false},{"$f":"AND(NOT(ISNUMBER(MATCH(DATE($A$2,INT((COLUMN()-1)/31.001)+$A$1,ROUNDUP(MOD(COLUMN()-1,31.001),0)),HolidayList[Date],0))),(VLOOKUP(VLOOKUP(WEEKDAY(DATE($A$2,INT((COLUMN()-1)/31.001)+$A$1,ROUNDUP(MOD(COLUMN()-1,31.001),0)),2),Sheet3!$D$1:$E$7,2,0),$NR$11:$NS$17,2,0)=\"Yes\"))","v":false},{"$f":"AND(NOT(ISNUMBER(MATCH(DATE($A$2,INT((COLUMN()-1)/31.001)+$A$1,ROUNDUP(MOD(COLUMN()-1,31.001),0)),HolidayList[Date],0))),(VLOOKUP(VLOOKUP(WEEKDAY(DATE($A$2,INT((COLUMN()-1)/31.001)+$A$1,ROUNDUP(MOD(COLUMN()-1,31.001),0)),2),Sheet3!$D$1:$E$7,2,0),$NR$11:$NS$17,2,0)=\"Yes\"))","v":false},{"$f":"AND(NOT(ISNUMBER(MATCH(DATE($A$2,INT((COLUMN()-1)/31.001)+$A$1,ROUNDUP(MOD(COLUMN()-1,31.001),0)),HolidayList[Date],0))),(VLOOKUP(VLOOKUP(WEEKDAY(DATE($A$2,INT((COLUMN()-1)/31.001)+$A$1,ROUNDUP(MOD(COLUMN()-1,31.001),0)),2),Sheet3!$D$1:$E$7,2,0),$NR$11:$NS$17,2,0)=\"Yes\"))","v":true},{"$f":"AND(NOT(ISNUMBER(MATCH(DATE($A$2,INT((COLUMN()-1)/31.001)+$A$1,ROUNDUP(MOD(COLUMN()-1,31.001),0)),HolidayList[Date],0))),(VLOOKUP(VLOOKUP(WEEKDAY(DATE($A$2,INT((COLUMN()-1)/31.001)+$A$1,ROUNDUP(MOD(COLUMN()-1,31.001),0)),2),Sheet3!$D$1:$E$7,2,0),$NR$11:$NS$17,2,0)=\"Yes\"))","v":true},{"$f":"AND(NOT(ISNUMBER(MATCH(DATE($A$2,INT((COLUMN()-1)/31.001)+$A$1,ROUNDUP(MOD(COLUMN()-1,31.001),0)),HolidayList[Date],0))),(VLOOKUP(VLOOKUP(WEEKDAY(DATE($A$2,INT((COLUMN()-1)/31.001)+$A$1,ROUNDUP(MOD(COLUMN()-1,31.001),0)),2),Sheet3!$D$1:$E$7,2,0),$NR$11:$NS$17,2,0)=\"Yes\"))","v":true},{"$f":"AND(NOT(ISNUMBER(MATCH(DATE($A$2,INT((COLUMN()-1)/31.001)+$A$1,ROUNDUP(MOD(COLUMN()-1,31.001),0)),HolidayList[Date],0))),(VLOOKUP(VLOOKUP(WEEKDAY(DATE($A$2,INT((COLUMN()-1)/31.001)+$A$1,ROUNDUP(MOD(COLUMN()-1,31.001),0)),2),Sheet3!$D$1:$E$7,2,0),$NR$11:$NS$17,2,0)=\"Yes\"))","v":true},{"$f":"AND(NOT(ISNUMBER(MATCH(DATE($A$2,INT((COLUMN()-1)/31.001)+$A$1,ROUNDUP(MOD(COLUMN()-1,31.001),0)),HolidayList[Date],0))),(VLOOKUP(VLOOKUP(WEEKDAY(DATE($A$2,INT((COLUMN()-1)/31.001)+$A$1,ROUNDUP(MOD(COLUMN()-1,31.001),0)),2),Sheet3!$D$1:$E$7,2,0),$NR$11:$NS$17,2,0)=\"Yes\"))","v":false},{"$f":"AND(NOT(ISNUMBER(MATCH(DATE($A$2,INT((COLUMN()-1)/31.001)+$A$1,ROUNDUP(MOD(COLUMN()-1,31.001),0)),HolidayList[Date],0))),(VLOOKUP(VLOOKUP(WEEKDAY(DATE($A$2,INT((COLUMN()-1)/31.001)+$A$1,ROUNDUP(MOD(COLUMN()-1,31.001),0)),2),Sheet3!$D$1:$E$7,2,0),$NR$11:$NS$17,2,0)=\"Yes\"))","v":false},{"$f":"AND(NOT(ISNUMBER(MATCH(DATE($A$2,INT((COLUMN()-1)/31.001)+$A$1,ROUNDUP(MOD(COLUMN()-1,31.001),0)),HolidayList[Date],0))),(VLOOKUP(VLOOKUP(WEEKDAY(DATE($A$2,INT((COLUMN()-1)/31.001)+$A$1,ROUNDUP(MOD(COLUMN()-1,31.001),0)),2),Sheet3!$D$1:$E$7,2,0),$NR$11:$NS$17,2,0)=\"Yes\"))","v":true},{"$f":"AND(NOT(ISNUMBER(MATCH(DATE($A$2,INT((COLUMN()-1)/31.001)+$A$1,ROUNDUP(MOD(COLUMN()-1,31.001),0)),HolidayList[Date],0))),(VLOOKUP(VLOOKUP(WEEKDAY(DATE($A$2,INT((COLUMN()-1)/31.001)+$A$1,ROUNDUP(MOD(COLUMN()-1,31.001),0)),2),Sheet3!$D$1:$E$7,2,0),$NR$11:$NS$17,2,0)=\"Yes\"))","v":true},{"$f":"AND(NOT(ISNUMBER(MATCH(DATE($A$2,INT((COLUMN()-1)/31.001)+$A$1,ROUNDUP(MOD(COLUMN()-1,31.001),0)),HolidayList[Date],0))),(VLOOKUP(VLOOKUP(WEEKDAY(DATE($A$2,INT((COLUMN()-1)/31.001)+$A$1,ROUNDUP(MOD(COLUMN()-1,31.001),0)),2),Sheet3!$D$1:$E$7,2,0),$NR$11:$NS$17,2,0)=\"Yes\"))","v":true},{"$f":"AND(NOT(ISNUMBER(MATCH(DATE($A$2,INT((COLUMN()-1)/31.001)+$A$1,ROUNDUP(MOD(COLUMN()-1,31.001),0)),HolidayList[Date],0))),(VLOOKUP(VLOOKUP(WEEKDAY(DATE($A$2,INT((COLUMN()-1)/31.001)+$A$1,ROUNDUP(MOD(COLUMN()-1,31.001),0)),2),Sheet3!$D$1:$E$7,2,0),$NR$11:$NS$17,2,0)=\"Yes\"))","v":true},{"$f":"AND(NOT(ISNUMBER(MATCH(DATE($A$2,INT((COLUMN()-1)/31.001)+$A$1,ROUNDUP(MOD(COLUMN()-1,31.001),0)),HolidayList[Date],0))),(VLOOKUP(VLOOKUP(WEEKDAY(DATE($A$2,INT((COLUMN()-1)/31.001)+$A$1,ROUNDUP(MOD(COLUMN()-1,31.001),0)),2),Sheet3!$D$1:$E$7,2,0),$NR$11:$NS$17,2,0)=\"Yes\"))","v":true},{"$f":"AND(NOT(ISNUMBER(MATCH(DATE($A$2,INT((COLUMN()-1)/31.001)+$A$1,ROUNDUP(MOD(COLUMN()-1,31.001),0)),HolidayList[Date],0))),(VLOOKUP(VLOOKUP(WEEKDAY(DATE($A$2,INT((COLUMN()-1)/31.001)+$A$1,ROUNDUP(MOD(COLUMN()-1,31.001),0)),2),Sheet3!$D$1:$E$7,2,0),$NR$11:$NS$17,2,0)=\"Yes\"))","v":false},{"$f":"AND(NOT(ISNUMBER(MATCH(DATE($A$2,INT((COLUMN()-1)/31.001)+$A$1,ROUNDUP(MOD(COLUMN()-1,31.001),0)),HolidayList[Date],0))),(VLOOKUP(VLOOKUP(WEEKDAY(DATE($A$2,INT((COLUMN()-1)/31.001)+$A$1,ROUNDUP(MOD(COLUMN()-1,31.001),0)),2),Sheet3!$D$1:$E$7,2,0),$NR$11:$NS$17,2,0)=\"Yes\"))","v":false},{"$f":"AND(NOT(ISNUMBER(MATCH(DATE($A$2,INT((COLUMN()-1)/31.001)+$A$1,ROUNDUP(MOD(COLUMN()-1,31.001),0)),HolidayList[Date],0))),(VLOOKUP(VLOOKUP(WEEKDAY(DATE($A$2,INT((COLUMN()-1)/31.001)+$A$1,ROUNDUP(MOD(COLUMN()-1,31.001),0)),2),Sheet3!$D$1:$E$7,2,0),$NR$11:$NS$17,2,0)=\"Yes\"))","v":true},{"$f":"AND(NOT(ISNUMBER(MATCH(DATE($A$2,INT((COLUMN()-1)/31.001)+$A$1,ROUNDUP(MOD(COLUMN()-1,31.001),0)),HolidayList[Date],0))),(VLOOKUP(VLOOKUP(WEEKDAY(DATE($A$2,INT((COLUMN()-1)/31.001)+$A$1,ROUNDUP(MOD(COLUMN()-1,31.001),0)),2),Sheet3!$D$1:$E$7,2,0),$NR$11:$NS$17,2,0)=\"Yes\"))","v":true},{"$f":"AND(NOT(ISNUMBER(MATCH(DATE($A$2,INT((COLUMN()-1)/31.001)+$A$1,ROUNDUP(MOD(COLUMN()-1,31.001),0)),HolidayList[Date],0))),(VLOOKUP(VLOOKUP(WEEKDAY(DATE($A$2,INT((COLUMN()-1)/31.001)+$A$1,ROUNDUP(MOD(COLUMN()-1,31.001),0)),2),Sheet3!$D$1:$E$7,2,0),$NR$11:$NS$17,2,0)=\"Yes\"))","v":true},{"$f":"AND(NOT(ISNUMBER(MATCH(DATE($A$2,INT((COLUMN()-1)/31.001)+$A$1,ROUNDUP(MOD(COLUMN()-1,31.001),0)),HolidayList[Date],0))),(VLOOKUP(VLOOKUP(WEEKDAY(DATE($A$2,INT((COLUMN()-1)/31.001)+$A$1,ROUNDUP(MOD(COLUMN()-1,31.001),0)),2),Sheet3!$D$1:$E$7,2,0),$NR$11:$NS$17,2,0)=\"Yes\"))","v":true},{"$f":"AND(NOT(ISNUMBER(MATCH(DATE($A$2,INT((COLUMN()-1)/31.001)+$A$1,ROUNDUP(MOD(COLUMN()-1,31.001),0)),HolidayList[Date],0))),(VLOOKUP(VLOOKUP(WEEKDAY(DATE($A$2,INT((COLUMN()-1)/31.001)+$A$1,ROUNDUP(MOD(COLUMN()-1,31.001),0)),2),Sheet3!$D$1:$E$7,2,0),$NR$11:$NS$17,2,0)=\"Yes\"))","v":true},{"$f":"AND(NOT(ISNUMBER(MATCH(DATE($A$2,INT((COLUMN()-1)/31.001)+$A$1,ROUNDUP(MOD(COLUMN()-1,31.001),0)),HolidayList[Date],0))),(VLOOKUP(VLOOKUP(WEEKDAY(DATE($A$2,INT((COLUMN()-1)/31.001)+$A$1,ROUNDUP(MOD(COLUMN()-1,31.001),0)),2),Sheet3!$D$1:$E$7,2,0),$NR$11:$NS$17,2,0)=\"Yes\"))","v":false},{"$f":"AND(NOT(ISNUMBER(MATCH(DATE($A$2,INT((COLUMN()-1)/31.001)+$A$1,ROUNDUP(MOD(COLUMN()-1,31.001),0)),HolidayList[Date],0))),(VLOOKUP(VLOOKUP(WEEKDAY(DATE($A$2,INT((COLUMN()-1)/31.001)+$A$1,ROUNDUP(MOD(COLUMN()-1,31.001),0)),2),Sheet3!$D$1:$E$7,2,0),$NR$11:$NS$17,2,0)=\"Yes\"))","v":false},{"$f":"AND(NOT(ISNUMBER(MATCH(DATE($A$2,INT((COLUMN()-1)/31.001)+$A$1,ROUNDUP(MOD(COLUMN()-1,31.001),0)),HolidayList[Date],0))),(VLOOKUP(VLOOKUP(WEEKDAY(DATE($A$2,INT((COLUMN()-1)/31.001)+$A$1,ROUNDUP(MOD(COLUMN()-1,31.001),0)),2),Sheet3!$D$1:$E$7,2,0),$NR$11:$NS$17,2,0)=\"Yes\"))","v":true},{"$f":"AND(NOT(ISNUMBER(MATCH(DATE($A$2,INT((COLUMN()-1)/31.001)+$A$1,ROUNDUP(MOD(COLUMN()-1,31.001),0)),HolidayList[Date],0))),(VLOOKUP(VLOOKUP(WEEKDAY(DATE($A$2,INT((COLUMN()-1)/31.001)+$A$1,ROUNDUP(MOD(COLUMN()-1,31.001),0)),2),Sheet3!$D$1:$E$7,2,0),$NR$11:$NS$17,2,0)=\"Yes\"))","v":true},{"$f":"AND(NOT(ISNUMBER(MATCH(DATE($A$2,INT((COLUMN()-1)/31.001)+$A$1,ROUNDUP(MOD(COLUMN()-1,31.001),0)),HolidayList[Date],0))),(VLOOKUP(VLOOKUP(WEEKDAY(DATE($A$2,INT((COLUMN()-1)/31.001)+$A$1,ROUNDUP(MOD(COLUMN()-1,31.001),0)),2),Sheet3!$D$1:$E$7,2,0),$NR$11:$NS$17,2,0)=\"Yes\"))","v":true},{"$f":"AND(NOT(ISNUMBER(MATCH(DATE($A$2,INT((COLUMN()-1)/31.001)+$A$1,ROUNDUP(MOD(COLUMN()-1,31.001),0)),HolidayList[Date],0))),(VLOOKUP(VLOOKUP(WEEKDAY(DATE($A$2,INT((COLUMN()-1)/31.001)+$A$1,ROUNDUP(MOD(COLUMN()-1,31.001),0)),2),Sheet3!$D$1:$E$7,2,0),$NR$11:$NS$17,2,0)=\"Yes\"))","v":true},{"$f":"AND(NOT(ISNUMBER(MATCH(DATE($A$2,INT((COLUMN()-1)/31.001)+$A$1,ROUNDUP(MOD(COLUMN()-1,31.001),0)),HolidayList[Date],0))),(VLOOKUP(VLOOKUP(WEEKDAY(DATE($A$2,INT((COLUMN()-1)/31.001)+$A$1,ROUNDUP(MOD(COLUMN()-1,31.001),0)),2),Sheet3!$D$1:$E$7,2,0),$NR$11:$NS$17,2,0)=\"Yes\"))","v":true},{"$f":"AND(NOT(ISNUMBER(MATCH(DATE($A$2,INT((COLUMN()-1)/31.001)+$A$1,ROUNDUP(MOD(COLUMN()-1,31.001),0)),HolidayList[Date],0))),(VLOOKUP(VLOOKUP(WEEKDAY(DATE($A$2,INT((COLUMN()-1)/31.001)+$A$1,ROUNDUP(MOD(COLUMN()-1,31.001),0)),2),Sheet3!$D$1:$E$7,2,0),$NR$11:$NS$17,2,0)=\"Yes\"))","v":false},{"$f":"AND(NOT(ISNUMBER(MATCH(DATE($A$2,INT((COLUMN()-1)/31.001)+$A$1,ROUNDUP(MOD(COLUMN()-1,31.001),0)),HolidayList[Date],0))),(VLOOKUP(VLOOKUP(WEEKDAY(DATE($A$2,INT((COLUMN()-1)/31.001)+$A$1,ROUNDUP(MOD(COLUMN()-1,31.001),0)),2),Sheet3!$D$1:$E$7,2,0),$NR$11:$NS$17,2,0)=\"Yes\"))","v":false},{"$f":"AND(NOT(ISNUMBER(MATCH(DATE($A$2,INT((COLUMN()-1)/31.001)+$A$1,ROUNDUP(MOD(COLUMN()-1,31.001),0)),HolidayList[Date],0))),(VLOOKUP(VLOOKUP(WEEKDAY(DATE($A$2,INT((COLUMN()-1)/31.001)+$A$1,ROUNDUP(MOD(COLUMN()-1,31.001),0)),2),Sheet3!$D$1:$E$7,2,0),$NR$11:$NS$17,2,0)=\"Yes\"))","v":true},{"$f":"AND(NOT(ISNUMBER(MATCH(DATE($A$2,INT((COLUMN()-1)/31.001)+$A$1,ROUNDUP(MOD(COLUMN()-1,31.001),0)),HolidayList[Date],0))),(VLOOKUP(VLOOKUP(WEEKDAY(DATE($A$2,INT((COLUMN()-1)/31.001)+$A$1,ROUNDUP(MOD(COLUMN()-1,31.001),0)),2),Sheet3!$D$1:$E$7,2,0),$NR$11:$NS$17,2,0)=\"Yes\"))","v":true},{"$f":"AND(NOT(ISNUMBER(MATCH(DATE($A$2,INT((COLUMN()-1)/31.001)+$A$1,ROUNDUP(MOD(COLUMN()-1,31.001),0)),HolidayList[Date],0))),(VLOOKUP(VLOOKUP(WEEKDAY(DATE($A$2,INT((COLUMN()-1)/31.001)+$A$1,ROUNDUP(MOD(COLUMN()-1,31.001),0)),2),Sheet3!$D$1:$E$7,2,0),$NR$11:$NS$17,2,0)=\"Yes\"))","v":true},{"$f":"AND(NOT(ISNUMBER(MATCH(DATE($A$2,INT((COLUMN()-1)/31.001)+$A$1,ROUNDUP(MOD(COLUMN()-1,31.001),0)),HolidayList[Date],0))),(VLOOKUP(VLOOKUP(WEEKDAY(DATE($A$2,INT((COLUMN()-1)/31.001)+$A$1,ROUNDUP(MOD(COLUMN()-1,31.001),0)),2),Sheet3!$D$1:$E$7,2,0),$NR$11:$NS$17,2,0)=\"Yes\"))","v":true},{"$f":"AND(NOT(ISNUMBER(MATCH(DATE($A$2,INT((COLUMN()-1)/31.001)+$A$1,ROUNDUP(MOD(COLUMN()-1,31.001),0)),HolidayList[Date],0))),(VLOOKUP(VLOOKUP(WEEKDAY(DATE($A$2,INT((COLUMN()-1)/31.001)+$A$1,ROUNDUP(MOD(COLUMN()-1,31.001),0)),2),Sheet3!$D$1:$E$7,2,0),$NR$11:$NS$17,2,0)=\"Yes\"))","v":true},{"$f":"AND(NOT(ISNUMBER(MATCH(DATE($A$2,INT((COLUMN()-1)/31.001)+$A$1,ROUNDUP(MOD(COLUMN()-1,31.001),0)),HolidayList[Date],0))),(VLOOKUP(VLOOKUP(WEEKDAY(DATE($A$2,INT((COLUMN()-1)/31.001)+$A$1,ROUNDUP(MOD(COLUMN()-1,31.001),0)),2),Sheet3!$D$1:$E$7,2,0),$NR$11:$NS$17,2,0)=\"Yes\"))","v":false},{"$f":"AND(NOT(ISNUMBER(MATCH(DATE($A$2,INT((COLUMN()-1)/31.001)+$A$1,ROUNDUP(MOD(COLUMN()-1,31.001),0)),HolidayList[Date],0))),(VLOOKUP(VLOOKUP(WEEKDAY(DATE($A$2,INT((COLUMN()-1)/31.001)+$A$1,ROUNDUP(MOD(COLUMN()-1,31.001),0)),2),Sheet3!$D$1:$E$7,2,0),$NR$11:$NS$17,2,0)=\"Yes\"))","v":false},{"$f":"AND(NOT(ISNUMBER(MATCH(DATE($A$2,INT((COLUMN()-1)/31.001)+$A$1,ROUNDUP(MOD(COLUMN()-1,31.001),0)),HolidayList[Date],0))),(VLOOKUP(VLOOKUP(WEEKDAY(DATE($A$2,INT((COLUMN()-1)/31.001)+$A$1,ROUNDUP(MOD(COLUMN()-1,31.001),0)),2),Sheet3!$D$1:$E$7,2,0),$NR$11:$NS$17,2,0)=\"Yes\"))","v":true},{"$f":"AND(NOT(ISNUMBER(MATCH(DATE($A$2,INT((COLUMN()-1)/31.001)+$A$1,ROUNDUP(MOD(COLUMN()-1,31.001),0)),HolidayList[Date],0))),(VLOOKUP(VLOOKUP(WEEKDAY(DATE($A$2,INT((COLUMN()-1)/31.001)+$A$1,ROUNDUP(MOD(COLUMN()-1,31.001),0)),2),Sheet3!$D$1:$E$7,2,0),$NR$11:$NS$17,2,0)=\"Yes\"))","v":true},{"$f":"AND(NOT(ISNUMBER(MATCH(DATE($A$2,INT((COLUMN()-1)/31.001)+$A$1,ROUNDUP(MOD(COLUMN()-1,31.001),0)),HolidayList[Date],0))),(VLOOKUP(VLOOKUP(WEEKDAY(DATE($A$2,INT((COLUMN()-1)/31.001)+$A$1,ROUNDUP(MOD(COLUMN()-1,31.001),0)),2),Sheet3!$D$1:$E$7,2,0),$NR$11:$NS$17,2,0)=\"Yes\"))","v":true},{"$f":"AND(NOT(ISNUMBER(MATCH(DATE($A$2,INT((COLUMN()-1)/31.001)+$A$1,ROUNDUP(MOD(COLUMN()-1,31.001),0)),HolidayList[Date],0))),(VLOOKUP(VLOOKUP(WEEKDAY(DATE($A$2,INT((COLUMN()-1)/31.001)+$A$1,ROUNDUP(MOD(COLUMN()-1,31.001),0)),2),Sheet3!$D$1:$E$7,2,0),$NR$11:$NS$17,2,0)=\"Yes\"))","v":true},{"$f":"AND(NOT(ISNUMBER(MATCH(DATE($A$2,INT((COLUMN()-1)/31.001)+$A$1,ROUNDUP(MOD(COLUMN()-1,31.001),0)),HolidayList[Date],0))),(VLOOKUP(VLOOKUP(WEEKDAY(DATE($A$2,INT((COLUMN()-1)/31.001)+$A$1,ROUNDUP(MOD(COLUMN()-1,31.001),0)),2),Sheet3!$D$1:$E$7,2,0),$NR$11:$NS$17,2,0)=\"Yes\"))","v":true},{"$f":"AND(NOT(ISNUMBER(MATCH(DATE($A$2,INT((COLUMN()-1)/31.001)+$A$1,ROUNDUP(MOD(COLUMN()-1,31.001),0)),HolidayList[Date],0))),(VLOOKUP(VLOOKUP(WEEKDAY(DATE($A$2,INT((COLUMN()-1)/31.001)+$A$1,ROUNDUP(MOD(COLUMN()-1,31.001),0)),2),Sheet3!$D$1:$E$7,2,0),$NR$11:$NS$17,2,0)=\"Yes\"))","v":false},{"$f":"AND(NOT(ISNUMBER(MATCH(DATE($A$2,INT((COLUMN()-1)/31.001)+$A$1,ROUNDUP(MOD(COLUMN()-1,31.001),0)),HolidayList[Date],0))),(VLOOKUP(VLOOKUP(WEEKDAY(DATE($A$2,INT((COLUMN()-1)/31.001)+$A$1,ROUNDUP(MOD(COLUMN()-1,31.001),0)),2),Sheet3!$D$1:$E$7,2,0),$NR$11:$NS$17,2,0)=\"Yes\"))","v":false},{"$f":"AND(NOT(ISNUMBER(MATCH(DATE($A$2,INT((COLUMN()-1)/31.001)+$A$1,ROUNDUP(MOD(COLUMN()-1,31.001),0)),HolidayList[Date],0))),(VLOOKUP(VLOOKUP(WEEKDAY(DATE($A$2,INT((COLUMN()-1)/31.001)+$A$1,ROUNDUP(MOD(COLUMN()-1,31.001),0)),2),Sheet3!$D$1:$E$7,2,0),$NR$11:$NS$17,2,0)=\"Yes\"))","v":true},{"$f":"AND(NOT(ISNUMBER(MATCH(DATE($A$2,INT((COLUMN()-1)/31.001)+$A$1,ROUNDUP(MOD(COLUMN()-1,31.001),0)),HolidayList[Date],0))),(VLOOKUP(VLOOKUP(WEEKDAY(DATE($A$2,INT((COLUMN()-1)/31.001)+$A$1,ROUNDUP(MOD(COLUMN()-1,31.001),0)),2),Sheet3!$D$1:$E$7,2,0),$NR$11:$NS$17,2,0)=\"Yes\"))","v":true},{"$f":"AND(NOT(ISNUMBER(MATCH(DATE($A$2,INT((COLUMN()-1)/31.001)+$A$1,ROUNDUP(MOD(COLUMN()-1,31.001),0)),HolidayList[Date],0))),(VLOOKUP(VLOOKUP(WEEKDAY(DATE($A$2,INT((COLUMN()-1)/31.001)+$A$1,ROUNDUP(MOD(COLUMN()-1,31.001),0)),2),Sheet3!$D$1:$E$7,2,0),$NR$11:$NS$17,2,0)=\"Yes\"))","v":true},{"$f":"AND(NOT(ISNUMBER(MATCH(DATE($A$2,INT((COLUMN()-1)/31.001)+$A$1,ROUNDUP(MOD(COLUMN()-1,31.001),0)),HolidayList[Date],0))),(VLOOKUP(VLOOKUP(WEEKDAY(DATE($A$2,INT((COLUMN()-1)/31.001)+$A$1,ROUNDUP(MOD(COLUMN()-1,31.001),0)),2),Sheet3!$D$1:$E$7,2,0),$NR$11:$NS$17,2,0)=\"Yes\"))","v":false},{"$f":"AND(NOT(ISNUMBER(MATCH(DATE($A$2,INT((COLUMN()-1)/31.001)+$A$1,ROUNDUP(MOD(COLUMN()-1,31.001),0)),HolidayList[Date],0))),(VLOOKUP(VLOOKUP(WEEKDAY(DATE($A$2,INT((COLUMN()-1)/31.001)+$A$1,ROUNDUP(MOD(COLUMN()-1,31.001),0)),2),Sheet3!$D$1:$E$7,2,0),$NR$11:$NS$17,2,0)=\"Yes\"))","v":true},{"$f":"AND(NOT(ISNUMBER(MATCH(DATE($A$2,INT((COLUMN()-1)/31.001)+$A$1,ROUNDUP(MOD(COLUMN()-1,31.001),0)),HolidayList[Date],0))),(VLOOKUP(VLOOKUP(WEEKDAY(DATE($A$2,INT((COLUMN()-1)/31.001)+$A$1,ROUNDUP(MOD(COLUMN()-1,31.001),0)),2),Sheet3!$D$1:$E$7,2,0),$NR$11:$NS$17,2,0)=\"Yes\"))","v":false},{"$f":"AND(NOT(ISNUMBER(MATCH(DATE($A$2,INT((COLUMN()-1)/31.001)+$A$1,ROUNDUP(MOD(COLUMN()-1,31.001),0)),HolidayList[Date],0))),(VLOOKUP(VLOOKUP(WEEKDAY(DATE($A$2,INT((COLUMN()-1)/31.001)+$A$1,ROUNDUP(MOD(COLUMN()-1,31.001),0)),2),Sheet3!$D$1:$E$7,2,0),$NR$11:$NS$17,2,0)=\"Yes\"))","v":false},{"$f":"AND(NOT(ISNUMBER(MATCH(DATE($A$2,INT((COLUMN()-1)/31.001)+$A$1,ROUNDUP(MOD(COLUMN()-1,31.001),0)),HolidayList[Date],0))),(VLOOKUP(VLOOKUP(WEEKDAY(DATE($A$2,INT((COLUMN()-1)/31.001)+$A$1,ROUNDUP(MOD(COLUMN()-1,31.001),0)),2),Sheet3!$D$1:$E$7,2,0),$NR$11:$NS$17,2,0)=\"Yes\"))","v":true},{"$f":"AND(NOT(ISNUMBER(MATCH(DATE($A$2,INT((COLUMN()-1)/31.001)+$A$1,ROUNDUP(MOD(COLUMN()-1,31.001),0)),HolidayList[Date],0))),(VLOOKUP(VLOOKUP(WEEKDAY(DATE($A$2,INT((COLUMN()-1)/31.001)+$A$1,ROUNDUP(MOD(COLUMN()-1,31.001),0)),2),Sheet3!$D$1:$E$7,2,0),$NR$11:$NS$17,2,0)=\"Yes\"))","v":true},{"$f":"AND(NOT(ISNUMBER(MATCH(DATE($A$2,INT((COLUMN()-1)/31.001)+$A$1,ROUNDUP(MOD(COLUMN()-1,31.001),0)),HolidayList[Date],0))),(VLOOKUP(VLOOKUP(WEEKDAY(DATE($A$2,INT((COLUMN()-1)/31.001)+$A$1,ROUNDUP(MOD(COLUMN()-1,31.001),0)),2),Sheet3!$D$1:$E$7,2,0),$NR$11:$NS$17,2,0)=\"Yes\"))","v":true},{"$f":"AND(NOT(ISNUMBER(MATCH(DATE($A$2,INT((COLUMN()-1)/31.001)+$A$1,ROUNDUP(MOD(COLUMN()-1,31.001),0)),HolidayList[Date],0))),(VLOOKUP(VLOOKUP(WEEKDAY(DATE($A$2,INT((COLUMN()-1)/31.001)+$A$1,ROUNDUP(MOD(COLUMN()-1,31.001),0)),2),Sheet3!$D$1:$E$7,2,0),$NR$11:$NS$17,2,0)=\"Yes\"))","v":true},{"$f":"AND(NOT(ISNUMBER(MATCH(DATE($A$2,INT((COLUMN()-1)/31.001)+$A$1,ROUNDUP(MOD(COLUMN()-1,31.001),0)),HolidayList[Date],0))),(VLOOKUP(VLOOKUP(WEEKDAY(DATE($A$2,INT((COLUMN()-1)/31.001)+$A$1,ROUNDUP(MOD(COLUMN()-1,31.001),0)),2),Sheet3!$D$1:$E$7,2,0),$NR$11:$NS$17,2,0)=\"Yes\"))","v":true},{"$f":"AND(NOT(ISNUMBER(MATCH(DATE($A$2,INT((COLUMN()-1)/31.001)+$A$1,ROUNDUP(MOD(COLUMN()-1,31.001),0)),HolidayList[Date],0))),(VLOOKUP(VLOOKUP(WEEKDAY(DATE($A$2,INT((COLUMN()-1)/31.001)+$A$1,ROUNDUP(MOD(COLUMN()-1,31.001),0)),2),Sheet3!$D$1:$E$7,2,0),$NR$11:$NS$17,2,0)=\"Yes\"))","v":true},{"$f":"AND(NOT(ISNUMBER(MATCH(DATE($A$2,INT((COLUMN()-1)/31.001)+$A$1,ROUNDUP(MOD(COLUMN()-1,31.001),0)),HolidayList[Date],0))),(VLOOKUP(VLOOKUP(WEEKDAY(DATE($A$2,INT((COLUMN()-1)/31.001)+$A$1,ROUNDUP(MOD(COLUMN()-1,31.001),0)),2),Sheet3!$D$1:$E$7,2,0),$NR$11:$NS$17,2,0)=\"Yes\"))","v":false},{"$f":"AND(NOT(ISNUMBER(MATCH(DATE($A$2,INT((COLUMN()-1)/31.001)+$A$1,ROUNDUP(MOD(COLUMN()-1,31.001),0)),HolidayList[Date],0))),(VLOOKUP(VLOOKUP(WEEKDAY(DATE($A$2,INT((COLUMN()-1)/31.001)+$A$1,ROUNDUP(MOD(COLUMN()-1,31.001),0)),2),Sheet3!$D$1:$E$7,2,0),$NR$11:$NS$17,2,0)=\"Yes\"))","v":false},{"$f":"AND(NOT(ISNUMBER(MATCH(DATE($A$2,INT((COLUMN()-1)/31.001)+$A$1,ROUNDUP(MOD(COLUMN()-1,31.001),0)),HolidayList[Date],0))),(VLOOKUP(VLOOKUP(WEEKDAY(DATE($A$2,INT((COLUMN()-1)/31.001)+$A$1,ROUNDUP(MOD(COLUMN()-1,31.001),0)),2),Sheet3!$D$1:$E$7,2,0),$NR$11:$NS$17,2,0)=\"Yes\"))","v":true},{"$f":"AND(NOT(ISNUMBER(MATCH(DATE($A$2,INT((COLUMN()-1)/31.001)+$A$1,ROUNDUP(MOD(COLUMN()-1,31.001),0)),HolidayList[Date],0))),(VLOOKUP(VLOOKUP(WEEKDAY(DATE($A$2,INT((COLUMN()-1)/31.001)+$A$1,ROUNDUP(MOD(COLUMN()-1,31.001),0)),2),Sheet3!$D$1:$E$7,2,0),$NR$11:$NS$17,2,0)=\"Yes\"))","v":true},{"$f":"AND(NOT(ISNUMBER(MATCH(DATE($A$2,INT((COLUMN()-1)/31.001)+$A$1,ROUNDUP(MOD(COLUMN()-1,31.001),0)),HolidayList[Date],0))),(VLOOKUP(VLOOKUP(WEEKDAY(DATE($A$2,INT((COLUMN()-1)/31.001)+$A$1,ROUNDUP(MOD(COLUMN()-1,31.001),0)),2),Sheet3!$D$1:$E$7,2,0),$NR$11:$NS$17,2,0)=\"Yes\"))","v":true},{"$f":"AND(NOT(ISNUMBER(MATCH(DATE($A$2,INT((COLUMN()-1)/31.001)+$A$1,ROUNDUP(MOD(COLUMN()-1,31.001),0)),HolidayList[Date],0))),(VLOOKUP(VLOOKUP(WEEKDAY(DATE($A$2,INT((COLUMN()-1)/31.001)+$A$1,ROUNDUP(MOD(COLUMN()-1,31.001),0)),2),Sheet3!$D$1:$E$7,2,0),$NR$11:$NS$17,2,0)=\"Yes\"))","v":true},{"$f":"AND(NOT(ISNUMBER(MATCH(DATE($A$2,INT((COLUMN()-1)/31.001)+$A$1,ROUNDUP(MOD(COLUMN()-1,31.001),0)),HolidayList[Date],0))),(VLOOKUP(VLOOKUP(WEEKDAY(DATE($A$2,INT((COLUMN()-1)/31.001)+$A$1,ROUNDUP(MOD(COLUMN()-1,31.001),0)),2),Sheet3!$D$1:$E$7,2,0),$NR$11:$NS$17,2,0)=\"Yes\"))","v":true},{"$f":"AND(NOT(ISNUMBER(MATCH(DATE($A$2,INT((COLUMN()-1)/31.001)+$A$1,ROUNDUP(MOD(COLUMN()-1,31.001),0)),HolidayList[Date],0))),(VLOOKUP(VLOOKUP(WEEKDAY(DATE($A$2,INT((COLUMN()-1)/31.001)+$A$1,ROUNDUP(MOD(COLUMN()-1,31.001),0)),2),Sheet3!$D$1:$E$7,2,0),$NR$11:$NS$17,2,0)=\"Yes\"))","v":false},{"$f":"AND(NOT(ISNUMBER(MATCH(DATE($A$2,INT((COLUMN()-1)/31.001)+$A$1,ROUNDUP(MOD(COLUMN()-1,31.001),0)),HolidayList[Date],0))),(VLOOKUP(VLOOKUP(WEEKDAY(DATE($A$2,INT((COLUMN()-1)/31.001)+$A$1,ROUNDUP(MOD(COLUMN()-1,31.001),0)),2),Sheet3!$D$1:$E$7,2,0),$NR$11:$NS$17,2,0)=\"Yes\"))","v":false},{"$f":"AND(NOT(ISNUMBER(MATCH(DATE($A$2,INT((COLUMN()-1)/31.001)+$A$1,ROUNDUP(MOD(COLUMN()-1,31.001),0)),HolidayList[Date],0))),(VLOOKUP(VLOOKUP(WEEKDAY(DATE($A$2,INT((COLUMN()-1)/31.001)+$A$1,ROUNDUP(MOD(COLUMN()-1,31.001),0)),2),Sheet3!$D$1:$E$7,2,0),$NR$11:$NS$17,2,0)=\"Yes\"))","v":true},{"$f":"AND(NOT(ISNUMBER(MATCH(DATE($A$2,INT((COLUMN()-1)/31.001)+$A$1,ROUNDUP(MOD(COLUMN()-1,31.001),0)),HolidayList[Date],0))),(VLOOKUP(VLOOKUP(WEEKDAY(DATE($A$2,INT((COLUMN()-1)/31.001)+$A$1,ROUNDUP(MOD(COLUMN()-1,31.001),0)),2),Sheet3!$D$1:$E$7,2,0),$NR$11:$NS$17,2,0)=\"Yes\"))","v":true},{"$f":"AND(NOT(ISNUMBER(MATCH(DATE($A$2,INT((COLUMN()-1)/31.001)+$A$1,ROUNDUP(MOD(COLUMN()-1,31.001),0)),HolidayList[Date],0))),(VLOOKUP(VLOOKUP(WEEKDAY(DATE($A$2,INT((COLUMN()-1)/31.001)+$A$1,ROUNDUP(MOD(COLUMN()-1,31.001),0)),2),Sheet3!$D$1:$E$7,2,0),$NR$11:$NS$17,2,0)=\"Yes\"))","v":true},{"$f":"AND(NOT(ISNUMBER(MATCH(DATE($A$2,INT((COLUMN()-1)/31.001)+$A$1,ROUNDUP(MOD(COLUMN()-1,31.001),0)),HolidayList[Date],0))),(VLOOKUP(VLOOKUP(WEEKDAY(DATE($A$2,INT((COLUMN()-1)/31.001)+$A$1,ROUNDUP(MOD(COLUMN()-1,31.001),0)),2),Sheet3!$D$1:$E$7,2,0),$NR$11:$NS$17,2,0)=\"Yes\"))","v":true},{"$f":"AND(NOT(ISNUMBER(MATCH(DATE($A$2,INT((COLUMN()-1)/31.001)+$A$1,ROUNDUP(MOD(COLUMN()-1,31.001),0)),HolidayList[Date],0))),(VLOOKUP(VLOOKUP(WEEKDAY(DATE($A$2,INT((COLUMN()-1)/31.001)+$A$1,ROUNDUP(MOD(COLUMN()-1,31.001),0)),2),Sheet3!$D$1:$E$7,2,0),$NR$11:$NS$17,2,0)=\"Yes\"))","v":true},{"$f":"AND(NOT(ISNUMBER(MATCH(DATE($A$2,INT((COLUMN()-1)/31.001)+$A$1,ROUNDUP(MOD(COLUMN()-1,31.001),0)),HolidayList[Date],0))),(VLOOKUP(VLOOKUP(WEEKDAY(DATE($A$2,INT((COLUMN()-1)/31.001)+$A$1,ROUNDUP(MOD(COLUMN()-1,31.001),0)),2),Sheet3!$D$1:$E$7,2,0),$NR$11:$NS$17,2,0)=\"Yes\"))","v":false},{"$f":"AND(NOT(ISNUMBER(MATCH(DATE($A$2,INT((COLUMN()-1)/31.001)+$A$1,ROUNDUP(MOD(COLUMN()-1,31.001),0)),HolidayList[Date],0))),(VLOOKUP(VLOOKUP(WEEKDAY(DATE($A$2,INT((COLUMN()-1)/31.001)+$A$1,ROUNDUP(MOD(COLUMN()-1,31.001),0)),2),Sheet3!$D$1:$E$7,2,0),$NR$11:$NS$17,2,0)=\"Yes\"))","v":false},{"$f":"AND(NOT(ISNUMBER(MATCH(DATE($A$2,INT((COLUMN()-1)/31.001)+$A$1,ROUNDUP(MOD(COLUMN()-1,31.001),0)),HolidayList[Date],0))),(VLOOKUP(VLOOKUP(WEEKDAY(DATE($A$2,INT((COLUMN()-1)/31.001)+$A$1,ROUNDUP(MOD(COLUMN()-1,31.001),0)),2),Sheet3!$D$1:$E$7,2,0),$NR$11:$NS$17,2,0)=\"Yes\"))","v":true},{"$f":"AND(NOT(ISNUMBER(MATCH(DATE($A$2,INT((COLUMN()-1)/31.001)+$A$1,ROUNDUP(MOD(COLUMN()-1,31.001),0)),HolidayList[Date],0))),(VLOOKUP(VLOOKUP(WEEKDAY(DATE($A$2,INT((COLUMN()-1)/31.001)+$A$1,ROUNDUP(MOD(COLUMN()-1,31.001),0)),2),Sheet3!$D$1:$E$7,2,0),$NR$11:$NS$17,2,0)=\"Yes\"))","v":true},{"$f":"AND(NOT(ISNUMBER(MATCH(DATE($A$2,INT((COLUMN()-1)/31.001)+$A$1,ROUNDUP(MOD(COLUMN()-1,31.001),0)),HolidayList[Date],0))),(VLOOKUP(VLOOKUP(WEEKDAY(DATE($A$2,INT((COLUMN()-1)/31.001)+$A$1,ROUNDUP(MOD(COLUMN()-1,31.001),0)),2),Sheet3!$D$1:$E$7,2,0),$NR$11:$NS$17,2,0)=\"Yes\"))","v":true},{"$f":"AND(NOT(ISNUMBER(MATCH(DATE($A$2,INT((COLUMN()-1)/31.001)+$A$1,ROUNDUP(MOD(COLUMN()-1,31.001),0)),HolidayList[Date],0))),(VLOOKUP(VLOOKUP(WEEKDAY(DATE($A$2,INT((COLUMN()-1)/31.001)+$A$1,ROUNDUP(MOD(COLUMN()-1,31.001),0)),2),Sheet3!$D$1:$E$7,2,0),$NR$11:$NS$17,2,0)=\"Yes\"))","v":true},{"$f":"AND(NOT(ISNUMBER(MATCH(DATE($A$2,INT((COLUMN()-1)/31.001)+$A$1,ROUNDUP(MOD(COLUMN()-1,31.001),0)),HolidayList[Date],0))),(VLOOKUP(VLOOKUP(WEEKDAY(DATE($A$2,INT((COLUMN()-1)/31.001)+$A$1,ROUNDUP(MOD(COLUMN()-1,31.001),0)),2),Sheet3!$D$1:$E$7,2,0),$NR$11:$NS$17,2,0)=\"Yes\"))","v":true},{"$f":"AND(NOT(ISNUMBER(MATCH(DATE($A$2,INT((COLUMN()-1)/31.001)+$A$1,ROUNDUP(MOD(COLUMN()-1,31.001),0)),HolidayList[Date],0))),(VLOOKUP(VLOOKUP(WEEKDAY(DATE($A$2,INT((COLUMN()-1)/31.001)+$A$1,ROUNDUP(MOD(COLUMN()-1,31.001),0)),2),Sheet3!$D$1:$E$7,2,0),$NR$11:$NS$17,2,0)=\"Yes\"))","v":false},{"$f":"AND(NOT(ISNUMBER(MATCH(DATE($A$2,INT((COLUMN()-1)/31.001)+$A$1,ROUNDUP(MOD(COLUMN()-1,31.001),0)),HolidayList[Date],0))),(VLOOKUP(VLOOKUP(WEEKDAY(DATE($A$2,INT((COLUMN()-1)/31.001)+$A$1,ROUNDUP(MOD(COLUMN()-1,31.001),0)),2),Sheet3!$D$1:$E$7,2,0),$NR$11:$NS$17,2,0)=\"Yes\"))","v":false},{"$f":"AND(NOT(ISNUMBER(MATCH(DATE($A$2,INT((COLUMN()-1)/31.001)+$A$1,ROUNDUP(MOD(COLUMN()-1,31.001),0)),HolidayList[Date],0))),(VLOOKUP(VLOOKUP(WEEKDAY(DATE($A$2,INT((COLUMN()-1)/31.001)+$A$1,ROUNDUP(MOD(COLUMN()-1,31.001),0)),2),Sheet3!$D$1:$E$7,2,0),$NR$11:$NS$17,2,0)=\"Yes\"))","v":false},{"$f":"AND(NOT(ISNUMBER(MATCH(DATE($A$2,INT((COLUMN()-1)/31.001)+$A$1,ROUNDUP(MOD(COLUMN()-1,31.001),0)),HolidayList[Date],0))),(VLOOKUP(VLOOKUP(WEEKDAY(DATE($A$2,INT((COLUMN()-1)/31.001)+$A$1,ROUNDUP(MOD(COLUMN()-1,31.001),0)),2),Sheet3!$D$1:$E$7,2,0),$NR$11:$NS$17,2,0)=\"Yes\"))","v":true},{"$f":"AND(NOT(ISNUMBER(MATCH(DATE($A$2,INT((COLUMN()-1)/31.001)+$A$1,ROUNDUP(MOD(COLUMN()-1,31.001),0)),HolidayList[Date],0))),(VLOOKUP(VLOOKUP(WEEKDAY(DATE($A$2,INT((COLUMN()-1)/31.001)+$A$1,ROUNDUP(MOD(COLUMN()-1,31.001),0)),2),Sheet3!$D$1:$E$7,2,0),$NR$11:$NS$17,2,0)=\"Yes\"))","v":true},{"$f":"AND(NOT(ISNUMBER(MATCH(DATE($A$2,INT((COLUMN()-1)/31.001)+$A$1,ROUNDUP(MOD(COLUMN()-1,31.001),0)),HolidayList[Date],0))),(VLOOKUP(VLOOKUP(WEEKDAY(DATE($A$2,INT((COLUMN()-1)/31.001)+$A$1,ROUNDUP(MOD(COLUMN()-1,31.001),0)),2),Sheet3!$D$1:$E$7,2,0),$NR$11:$NS$17,2,0)=\"Yes\"))","v":true},{"$f":"AND(NOT(ISNUMBER(MATCH(DATE($A$2,INT((COLUMN()-1)/31.001)+$A$1,ROUNDUP(MOD(COLUMN()-1,31.001),0)),HolidayList[Date],0))),(VLOOKUP(VLOOKUP(WEEKDAY(DATE($A$2,INT((COLUMN()-1)/31.001)+$A$1,ROUNDUP(MOD(COLUMN()-1,31.001),0)),2),Sheet3!$D$1:$E$7,2,0),$NR$11:$NS$17,2,0)=\"Yes\"))","v":true},{"$f":"AND(NOT(ISNUMBER(MATCH(DATE($A$2,INT((COLUMN()-1)/31.001)+$A$1,ROUNDUP(MOD(COLUMN()-1,31.001),0)),HolidayList[Date],0))),(VLOOKUP(VLOOKUP(WEEKDAY(DATE($A$2,INT((COLUMN()-1)/31.001)+$A$1,ROUNDUP(MOD(COLUMN()-1,31.001),0)),2),Sheet3!$D$1:$E$7,2,0),$NR$11:$NS$17,2,0)=\"Yes\"))","v":false},{"$f":"AND(NOT(ISNUMBER(MATCH(DATE($A$2,INT((COLUMN()-1)/31.001)+$A$1,ROUNDUP(MOD(COLUMN()-1,31.001),0)),HolidayList[Date],0))),(VLOOKUP(VLOOKUP(WEEKDAY(DATE($A$2,INT((COLUMN()-1)/31.001)+$A$1,ROUNDUP(MOD(COLUMN()-1,31.001),0)),2),Sheet3!$D$1:$E$7,2,0),$NR$11:$NS$17,2,0)=\"Yes\"))","v":false},{"$nulls":8},"Vacation","V"]
[null,{"$f":"IFERROR(IF(AND(VLOOKUP(B6,$NR$11:$NS$17,2,0)=\"Yes\",NOT(ISNUMBER(VLOOKUP(DATE($A$2,$A$3+$A$1-1,B5),HolidayList[Date],1,0)))),TRUE,FALSE),FALSE)","v":false},{"$f":"IFERROR(IF(AND(VLOOKUP(C6,$NR$11:$NS$17,2,0)=\"Yes\",NOT(ISNUMBER(VLOOKUP(DATE($A$2,$A$3+$A$1-1,C5),HolidayList[Date],1,0)))),TRUE,FALSE),FALSE)","v":true},{"$f":"IFERROR(IF(AND(VLOOKUP(D6,$NR$11:$NS$17,2,0)=\"Yes\",NOT(ISNUMBER(VLOOKUP(DATE($A$2,$A$3+$A$1-1,D5),HolidayList[Date],1,0)))),TRUE,FALSE),FALSE)","v":true},{"$f":"IFERROR(IF(AND(VLOOKUP(E6,$NR$11:$NS$17,2,0)=\"Yes\",NOT(ISNUMBER(VLOOKUP(DATE($A$2,$A$3+$A$1-1,E5),HolidayList[Date],1,0)))),TRUE,FALSE),FALSE)","v":true},{"$f":"IFERROR(IF(AND(VLOOKUP(F6,$NR$11:$NS$17,2,0)=\"Yes\",NOT(ISNUMBER(VLOOKUP(DATE($A$2,$A$3+$A$1-1,F5),HolidayList[Date],1,0)))),TRUE,FALSE),FALSE)","v":true},{"$f":"IFERROR(IF(AND(VLOOKUP(G6,$NR$11:$NS$17,2,0)=\"Yes\",NOT(ISNUMBER(VLOOKUP(DATE($A$2,$A$3+$A$1-1,G5),HolidayList[Date],1,0)))),TRUE,FALSE),FALSE)","v":true},{"$f":"IFERROR(IF(AND(VLOOKUP(H6,$NR$11:$NS$17,2,0)=\"Yes\",NOT(ISNUMBER(VLOOKUP(DATE($A$2,$A$3+$A$1-1,H5),HolidayList[Date],1,0)))),TRUE,FALSE),FALSE)","v":false},{"$f":"IFERROR(IF(AND(VLOOKUP(I6,$NR$11:$NS$17,2,0)=\"Yes\",NOT(ISNUMBER(VLOOKUP(DATE($A$2,$A$3+$A$1-1,I5),HolidayList[Date],1,0)))),TRUE,FALSE),FALSE)","v":false},{"$f":"IFERROR(IF(AND(VLOOKUP(J6,$NR$11:$NS$17,2,0)=\"Yes\",NOT(ISNUMBER(VLOOKUP(DATE($A$2,$A$3+$A$1-1,J5),HolidayList[Date],1,0)))),TRUE,FALSE),FALSE)","v":true},{"$f":"IFERROR(IF(AND(VLOOKUP(K6,$NR$11:$NS$17,2,0)=\"Yes\",NOT(ISNUMBER(VLOOKUP(DATE($A$2,$A$3+$A$1-1,K5),HolidayList[Date],1,0)))),TRUE,FALSE),FALSE)","v":true},{"$f":"IFERROR(IF(AND(VLOOKUP(L6,$NR$11:$NS$17,2,0)=\"Yes\",NOT(ISNUMBER(VLOOKUP(DATE($A$2,$A$3+$A$1-1,L5),HolidayList[Date],1,0)))),TRUE,FALSE),FALSE)","v":true},{"$f":"IFERROR(IF(AND(VLOOKUP(M6,$NR$11:$NS$17,2,0)=\"Yes\",NOT(ISNUMBER(VLOOKUP(DATE($A$2,$A$3+$A$1-1,M5),HolidayList[Date],1,0)))),TRUE,FALSE),FALSE)","v":true},{"$f":"IFERROR(IF(AND(VLOOKUP(N6,$NR$11:$NS$17,2,0)=\"Yes\",NOT(ISNUMBER(VLOOKUP(DATE($A$2,$A$3+$A$1-1,N5),HolidayList[Date],1,0)))),TRUE,FALSE),FALSE)","v":true},{"$f":"IFERROR(IF(AND(VLOOKUP(O6,$NR$11:$NS$17,2,0)=\"Yes\",NOT(ISNUMBER(VLOOKUP(DATE($A$2,$A$3+$A$1-1,O5),HolidayList[Date],1,0)))),TRUE,FALSE),FALSE)","v":false},{"$f":"IFERROR(IF(AND(VLOOKUP(P6,$NR$11:$NS$17,2,0)=\"Yes\",NOT(ISNUMBER(VLOOKUP(DATE($A$2,$A$3+$A$1-1,P5),HolidayList[Date],1,0)))),TRUE,FALSE),FALSE)","v":false},{"$f":"IFERROR(IF(AND(VLOOKUP(Q6,$NR$11:$NS$17,2,0)=\"Yes\",NOT(ISNUMBER(VLOOKUP(DATE($A$2,$A$3+$A$1-1,Q5),HolidayList[Date],1,0)))),TRUE,FALSE),FALSE)","v":false},{"$f":"IFERROR(IF(AND(VLOOKUP(R6,$NR$11:$NS$17,2,0)=\"Yes\",NOT(ISNUMBER(VLOOKUP(DATE($A$2,$A$3+$A$1-1,R5),HolidayList[Date],1,0)))),TRUE,FALSE),FALSE)","v":true},{"$f":"IFERROR(IF(AND(VLOOKUP(S6,$NR$11:$NS$17,2,0)=\"Yes\",NOT(ISNUMBER(VLOOKUP(DATE($A$2,$A$3+$A$1-1,S5),HolidayList[Date],1,0)))),TRUE,FALSE),FALSE)","v":true},{"$f":"IFERROR(IF(AND(VLOOKUP(T6,$NR$11:$NS$17,2,0)=\"Yes\",NOT(ISNUMBER(VLOOKUP(DATE($A$2,$A$3+$A$1-1,T5),HolidayList[Date],1,0)))),TRUE,FALSE),FALSE)","v":true},{"$f":"IFERROR(IF(AND(VLOOKUP(U6,$NR$11:$NS$17,2,0)=\"Yes\",NOT(ISNUMBER(VLOOKUP(DATE($A$2,$A$3+$A$1-1,U5),HolidayList[Date],1,0)))),TRUE,FALSE),FALSE)","v":true},{"$f":"IFERROR(IF(AND(VLOOKUP(V6,$NR$11:$NS$17,2,0)=\"Yes\",NOT(ISNUMBER(VLOOKUP(DATE($A$2,$A$3+$A$1-1,V5),HolidayList[Date],1,0)))),TRUE,FALSE),FALSE)","v":false},{"$f":"IFERROR(IF(AND(VLOOKUP(W6,$NR$11:$NS$17,2,0)=\"Yes\",NOT(ISNUMBER(VLOOKUP(DATE($A$2,$A$3+$A$1-1,W5),HolidayList[Date],1,0)))),TRUE,FALSE),FALSE)","v":false},{"$f":"IFERROR(IF(AND(VLOOKUP(X6,$NR$11:$NS$17,2,0)=\"Yes\",NOT(ISNUMBER(VLOOKUP(DATE($A$2,$A$3+$A$1-1,X5),HolidayList[Date],1,0)))),TRUE,FALSE),FALSE)","v":true},{"$f":"IFERROR(IF(AND(VLOOKUP(Y6,$NR$11:$NS$17,2,0)=\"Yes\",NOT(ISNUMBER(VLOOKUP(DATE($A$2,$A$3+$A$1-1,Y5),HolidayList[Date],1,0)))),TRUE,FALSE),FALSE)","v":true},{"$f":"IFERROR(IF(AND(VLOOKUP(Z6,$NR$11:$NS$17,2,0)=\"Yes\",NOT(ISNUMBER(VLOOKUP(DATE($A$2,$A$3+$A$1-1,Z5),HolidayList[Date],1,0)))),TRUE,FALSE),FALSE)","v":true},{"$f":"IFERROR(IF(AND(VLOOKUP(AA6,$NR$11:$NS$17,2,0)=\"Yes\",NOT(ISNUMBER(VLOOKUP(DATE($A$2,$A$3+$A$1-1,AA5),HolidayList[Date],1,0)))),TRUE,FALSE),FALSE)","v":true},{"$f":"IFERROR(IF(AND(VLOOKUP(AB6,$NR$11:$NS$17,2,0)=\"Yes\",NOT(ISNUMBER(VLOOKUP(DATE($A$2,$A$3+$A$1-1,AB5),HolidayList[Date],1,0)))),TRUE,FALSE),FALSE)","v":true},{"$f":"IFERROR(IF(AND(VLOOKUP(AC6,$NR$11:$NS$17,2,0)=\"Yes\",NOT(ISNUMBER(VLOOKUP(DATE($A$2,$A$3+$A$1-1,AC5),HolidayList[Date],1,0)))),TRUE,FALSE),FALSE)","v":false},{"$f":"IFERROR(IF(AND(VLOOKUP(AD6,$NR$11:$NS$17,2,0)=\"Yes\",NOT(ISNUMBER(VLOOKUP(DATE($A$2,$A$3+$A$1-1,AD5),HolidayList[Date],1,0)))),TRUE,FALSE),FALSE)","v":false},{"$f":"IFERROR(IF(AND(VLOOKUP(AE6,$NR$11:$NS$17,2,0)=\"Yes\",NOT(ISNUMBER(VLOOKUP(DATE($A$2,$A$3+$A$1-1,AE5),HolidayList[Date],1,0)))),TRUE,FALSE),FALSE)","v":true},{"$f":"IFERROR(IF(AND(VLOOKUP(AF6,$NR$11:$NS$17,2,0)=\"Yes\",NOT(ISNUMBER(VLOOKUP(DATE($A$2,$A$3+$A$1-1,AF5),HolidayList[Date],1,0)))),TRUE,FALSE),FALSE)","v":true},{"$f":"IFERROR(IF(AND(VLOOKUP(AG6,$NR$11:$NS$17,2,0)=\"Yes\",NOT(ISNUMBER(VLOOKUP(DATE($A$2,$A$3+$A$1-1,AG5),HolidayList[Date],1,0)))),TRUE,FALSE),FALSE)","v":false},{"$f":"IFERROR(IF(AND(VLOOKUP(AH6,$NR$11:$NS$17,2,0)=\"Yes\",NOT(ISNUMBER(VLOOKUP(DATE($A$2,$A$3+$A$1-1,AH5),HolidayList[Date],1,0)))),TRUE,FALSE),FALSE)","v":false},{"$f":"IFERROR(IF(AND(VLOOKUP(AI6,$NR$11:$NS$17,2,0)=\"Yes\",NOT(ISNUMBER(VLOOKUP(DATE($A$2,$A$3+$A$1-1,AI5),HolidayList[Date],1,0)))),TRUE,FALSE),FALSE)","v":false},{"$f":"IFERROR(IF(AND(VLOOKUP(AJ6,$NR$11:$NS$17,2,0)=\"Yes\",NOT(ISNUMBER(VLOOKUP(DATE($A$2,$A$3+$A$1-1,AJ5),HolidayList[Date],1,0)))),TRUE,FALSE),FALSE)","v":false},{"$f":"IFERROR(IF(AND(VLOOKUP(AK6,$NR$11:$NS$17,2,0)=\"Yes\",NOT(ISNUMBER(VLOOKUP(DATE($A$2,$A$3+$A$1-1,AK5),HolidayList[Date],1,0)))),TRUE,FALSE),FALSE)","v":false},{"$f":"IFERROR(IF(AND(VLOOKUP(AL6,$NR$11:$NS$17,2,0)=\"Yes\",NOT(ISNUMBER(VLOOKUP(DATE($A$2,$A$3+$A$1-1,AL5),HolidayList[Date],1,0)))),TRUE,FALSE),FALSE)","v":false},{"$f":"IFERROR(IF(AND(VLOOKUP(AM6,$NR$11:$NS$17,2,0)=\"Yes\",NOT(ISNUMBER(VLOOKUP(DATE($A$2,$A$3+$A$1-1,AM5),HolidayList[Date],1,0)))),TRUE,FALSE),FALSE)","v":false},{"$f":"IFERROR(IF(AND(VLOOKUP(AN6,$NR$11:$NS$17,2,0)=\"Yes\",NOT(ISNUMBER(VLOOKUP(DATE($A$2,$A$3+$A$1-1,AN5),HolidayList[Date],1,0)))),TRUE,FALSE),FALSE)","v":false},{"$f":"IFERROR(IF(AND(VLOOKUP(AO6,$NR$11:$NS$17,2,0)=\"Yes\",NOT(ISNUMBER(VLOOKUP(DATE($A$2,$A$3+$A$1-1,AO5),HolidayList[Date],1,0)))),TRUE,FALSE),FALSE)","v":false},{"$f":"IFERROR(IF(AND(VLOOKUP(AP6,$NR$11:$NS$17,2,0)=\"Yes\",NOT(ISNUMBER(VLOOKUP(DATE($A$2,$A$3+$A$1-1,AP5),HolidayList[Date],1,0)))),TRUE,FALSE),FALSE)","v":false},{"$f":"IFERROR(IF(AND(VLOOKUP(AQ6,$NR$11:$NS$17,2,0)=\"Yes\",NOT(ISNUMBER(VLOOKUP(DATE($A$2,$A$3+$A$1-1,AQ5),HolidayList[Date],1,0)))),TRUE,FALSE),FALSE)","v":false},{"$f":"IFERROR(IF(AND(VLOOKUP(AR6,$NR$11:$NS$17,2,0)=\"Yes\",NOT(ISNUMBER(VLOOKUP(DATE($A$2,$A$3+$A$1-1,AR5),HolidayList[Date],1,0)))),TRUE,FALSE),FALSE)","v":false},{"$f":"IFERROR(IF(AND(VLOOKUP(AS6,$NR$11:$NS$17,2,0)=\"Yes\",NOT(ISNUMBER(VLOOKUP(DATE($A$2,$A$3+$A$1-1,AS5),HolidayList[Date],1,0)))),TRUE,FALSE),FALSE)","v":false},{"$f":"IFERROR(IF(AND(VLOOKUP(AT6,$NR$11:$NS$17,2,0)=\"Yes\",NOT(ISNUMBER(VLOOKUP(DATE($A$2,$A$3+$A$1-1,AT5),HolidayList[Date],1,0)))),TRUE,FALSE),FALSE)","v":false},{"$f":"IFERROR(IF(AND(VLOOKUP(AU6,$NR$11:$NS$17,2,0)=\"Yes\",NOT(ISNUMBER(VLOOKUP(DATE($A$2,$A$3+$A$1-1,AU5),HolidayList[Date],1,0)))),TRUE,FALSE),FALSE)","v":false},{"$f":"IFERROR(IF(AND(VLOOKUP(AV6,$NR$11:$NS$17,2,0)=\"Yes\",NOT(ISNUMBER(VLOOKUP(DATE($A$2,$A$3+$A$1-1,AV5),HolidayList[Date],1,0)))),TRUE,FALSE),FALSE)","v":false},{"$f":"IFERROR(IF(AND(VLOOKUP(AW6,$NR$11:$NS$17,2,0)=\"Yes\",NOT(ISNUMBER(VLOOKUP(DATE($A$2,$A$3+$A$1-1,AW5),HolidayList[Date],1,0)))),TRUE,FALSE),FALSE)","v":false},{"$f":"IFERROR(IF(AND(VLOOKUP(AX6,$NR$11:$NS$17,2,0)=\"Yes\",NOT(ISNUMBER(VLOOKUP(DATE($A$2,$A$3+$A$1-1,AX5),HolidayList[Date],1,0)))),TRUE,FALSE),FALSE)","v":false},{"$f":"IFERROR(IF(AND(VLOOKUP(AY6,$NR$11:$NS$17,2,0)=\"Yes\",NOT(ISNUMBER(VLOOKUP(DATE($A$2,$A$3+$A$1-1,AY5),HolidayList[Date],1,0)))),TRUE,FALSE),FALSE)","v":false},{"$f":"IFERROR(IF(AND(VLOOKUP(AZ6,$NR$11:$NS$17,2,0)=\"Yes\",NOT(ISNUMBER(VLOOKUP(DATE($A$2,$A$3+$A$1-1,AZ5),HolidayList[Date],1,0)))),TRUE,FALSE),FALSE)","v":false},{"$f":"IFERROR(IF(AND(VLOOKUP(BA6,$NR$11:$NS$17,2,0)=\"Yes\",NOT(ISNUMBER(VLOOKUP(DATE($A$2,$A$3+$A$1-1,BA5),HolidayList[Date],1,0)))),TRUE,FALSE),FALSE)","v":false},{"$f":"IFERROR(IF(AND(VLOOKUP(BB6,$NR$11:$NS$17,2,0)=\"Yes\",NOT(ISNUMBER(VLOOKUP(DATE($A$2,$A$3+$A$1-1,BB5),HolidayList[Date],1,0)))),TRUE,FALSE),FALSE)","v":false},{"$f":"IFERROR(IF(AND(VLOOKUP(BC6,$NR$11:$NS$17,2,0)=\"Yes\",NOT(ISNUMBER(VLOOKUP(DATE($A$2,$A$3+$A$1-1,BC5),HolidayList[Date],1,0)))),TRUE,FALSE),FALSE)","v":false},{"$f":"IFERROR(IF(AND(VLOOKUP(BD6,$NR$11:$NS$17,2,0)=\"Yes\",NOT(ISNUMBER(VLOOKUP(DATE($A$2,$A$3+$A$1-1,BD5),HolidayList[Date],1,0)))),TRUE,FALSE),FALSE)","v":false},{"$f":"IFERROR(IF(AND(VLOOKUP(BE6,$NR$11:$NS$17,2,0)=\"Yes\",NOT(ISNUMBER(VLOOKUP(DATE($A$2,$A$3+$A$1-1,BE5),HolidayList[Date],1,0)))),TRUE,FALSE),FALSE)","v":false},{"$f":"IFERROR(IF(AND(VLOOKUP(BF6,$NR$11:$NS$17,2,0)=\"Yes\",NOT(ISNUMBER(VLOOKUP(DATE($A$2,$A$3+$A$1-1,BF5),HolidayList[Date],1,0)))),TRUE,FALSE),FALSE)","v":false},{"$f":"IFERROR(IF(AND(VLOOKUP(BG6,$NR$11:$NS$17,2,0)=\"Yes\",NOT(ISNUMBER(VLOOKUP(DATE($A$2,$A$3+$A$1-1,BG5),HolidayList[Date],1,0)))),TRUE,FALSE),FALSE)","v":false},{"$f":"IFERROR(IF(AND(VLOOKUP(BH6,$NR$11:$NS$17,2,0)=\"Yes\",NOT(ISNUMBER(VLOOKUP(DATE($A$2,$A$3+$A$1-1,BH5),HolidayList[Date],1,0)))),TRUE,FALSE),FALSE)","v":false},{"$f":"IFERROR(IF(AND(VLOOKUP(BI6,$NR$11:$NS$17,2,0)=\"Yes\",NOT(ISNUMBER(VLOOKUP(DATE($A$2,$A$3+$A$1-1,BI5),HolidayList[Date],1,0)))),TRUE,FALSE),FALSE)","v":false},{"$f":"IFERROR(IF(AND(VLOOKUP(BJ6,$NR$11:$NS$17,2,0)=\"Yes\",NOT(ISNUMBER(VLOOKUP(DATE($A$2,$A$3+$A$1-1,BJ5),HolidayList[Date],1,0)))),TRUE,FALSE),FALSE)","v":false},{"$f":"IFERROR(IF(AND(VLOOKUP(BK6,$NR$11:$NS$17,2,0)=\"Yes\",NOT(ISNUMBER(VLOOKUP(DATE($A$2,$A$3+$A$1-1,BK5),HolidayList[Date],1,0)))),TRUE,FALSE),FALSE)","v":false},{"$f":"IFERROR(IF(AND(VLOOKUP(BL6,$NR$11:$NS$17,2,0)=\"Yes\",NOT(ISNUMBER(VLOOKUP(DATE($A$2,$A$3+$A$1-1,BL5),HolidayList[Date],1,0)))),TRUE,FALSE),FALSE)","v":false},{"$f":"IFERROR(IF(AND(VLOOKUP(BM6,$NR$11:$NS$17,2,0)=\"Yes\",NOT(ISNUMBER(VLOOKUP(DATE($A$2,$A$3+$A$1-1,BM5),HolidayList[Date],1,0)))),TRUE,FALSE),FALSE)","v":false},{"$f":"IFERROR(IF(AND(VLOOKUP(BN6,$NR$11:$NS$17,2,0)=\"Yes\",NOT(ISNUMBER(VLOOKUP(DATE($A$2,$A$3+$A$1-1,BN5),HolidayList[Date],1,0)))),TRUE,FALSE),FALSE)","v":false},{"$f":"IFERROR(IF(AND(VLOOKUP(BO6,$NR$11:$NS$17,2,0)=\"Yes\",NOT(ISNUMBER(VLOOKUP(DATE($A$2,$A$3+$A$1-1,BO5),HolidayList[Date],1,0)))),TRUE,FALSE),FALSE)","v":false},{"$f":"IFERROR(IF(AND(VLOOKUP(BP6,$NR$11:$NS$17,2,0)=\"Yes\",NOT(ISNUMBER(VLOOKUP(DATE($A$2,$A$3+$A$1-1,BP5),HolidayList[Date],1,0)))),TRUE,FALSE),FALSE)","v":false},{"$f":"IFERROR(IF(AND(VLOOKUP(BQ6,$NR$11:$NS$17,2,0)=\"Yes\",NOT(ISNUMBER(VLOOKUP(DATE($A$2,$A$3+$A$1-1,BQ5),HolidayList[Date],1,0)))),TRUE,FALSE),FALSE)","v":false},{"$f":"IFERROR(IF(AND(VLOOKUP(BR6,$NR$11:$NS$17,2,0)=\"Yes\",NOT(ISNUMBER(VLOOKUP(DATE($A$2,$A$3+$A$1-1,BR5),HolidayList[Date],1,0)))),TRUE,FALSE),FALSE)","v":false},{"$f":"IFERROR(IF(AND(VLOOKUP(BS6,$NR$11:$NS$17,2,0)=\"Yes\",NOT(ISNUMBER(VLOOKUP(DATE($A$2,$A$3+$A$1-1,BS5),HolidayList[Date],1,0)))),TRUE,FALSE),FALSE)","v":false},{"$f":"IFERROR(IF(AND(VLOOKUP(BT6,$NR$11:$NS$17,2,0)=\"Yes\",NOT(ISNUMBER(VLOOKUP(DATE($A$2,$A$3+$A$1-1,BT5),HolidayList[Date],1,0)))),TRUE,FALSE),FALSE)","v":false},{"$f":"IFERROR(IF(AND(VLOOKUP(BU6,$NR$11:$NS$17,2,0)=\"Yes\",NOT(ISNUMBER(VLOOKUP(DATE($A$2,$A$3+$A$1-1,BU5),HolidayList[Date],1,0)))),TRUE,FALSE),FALSE)","v":false},{"$f":"IFERROR(IF(AND(VLOOKUP(BV6,$NR$11:$NS$17,2,0)=\"Yes\",NOT(ISNUMBER(VLOOKUP(DATE($A$2,$A$3+$A$1-1,BV5),HolidayList[Date],1,0)))),TRUE,FALSE),FALSE)","v":false},{"$f":"IFERROR(IF(AND(VLOOKUP(BW6,$NR$11:$NS$17,2,0)=\"Yes\",NOT(ISNUMBER(VLOOKUP(DATE($A$2,$A$3+$A$1-1,BW5),HolidayList[Date],1,0)))),TRUE,FALSE),FALSE)","v":false},{"$f":"IFERROR(IF(AND(VLOOKUP(BX6,$NR$11:$NS$17,2,0)=\"Yes\",NOT(ISNUMBER(VLOOKUP(DATE($A$2,$A$3+$A$1-1,BX5),HolidayList[Date],1,0)))),TRUE,FALSE),FALSE)","v":false},{"$f":"IFERROR(IF(AND(VLOOKUP(BY6,$NR$11:$NS$17,2,0)=\"Yes\",NOT(ISNUMBER(VLOOKUP(DATE($A$2,$A$3+$A$1-1,BY5),HolidayList[Date],1,0)))),TRUE,FALSE),FALSE)","v":false},{"$f":"IFERROR(IF(AND(VLOOKUP(BZ6,$NR$11:$NS$17,2,0)=\"Yes\",NOT(ISNUMBER(VLOOKUP(DATE($A$2,$A$3+$A$1-1,BZ5),HolidayList[Date],1,0)))),TRUE,FALSE),FALSE)","v":false},{"$f":"IFERROR(IF(AND(VLOOKUP(CA6,$NR$11:$NS$17,2,0)=\"Yes\",NOT(ISNUMBER(VLOOKUP(DATE($A$2,$A$3+$A$1-1,CA5),HolidayList[Date],1,0)))),TRUE,FALSE),FALSE)","v":false},{"$f":"IFERROR(IF(AND(VLOOKUP(CB6,$NR$11:$NS$17,2,0)=\"Yes\",NOT(ISNUMBER(VLOOKUP(DATE($A$2,$A$3+$A$1-1,CB5),HolidayList[Date],1,0)))),TRUE,FALSE),FALSE)","v":false},{"$f":"IFERROR(IF(AND(VLOOKUP(CC6,$NR$11:$NS$17,2,0)=\"Yes\",NOT(ISNUMBER(VLOOKUP(DATE($A$2,$A$3+$A$1-1,CC5),HolidayList[Date],1,0)))),TRUE,FALSE),FALSE)","v":false},{"$f":"IFERROR(IF(AND(VLOOKUP(CD6,$NR$11:$NS$17,2,0)=\"Yes\",NOT(ISNUMBER(VLOOKUP(DATE($A$2,$A$3+$A$1-1,CD5),HolidayList[Date],1,0)))),TRUE,FALSE),FALSE)","v":false},{"$f":"IFERROR(IF(AND(VLOOKUP(CE6,$NR$11:$NS$17,2,0)=\"Yes\",NOT(ISNUMBER(VLOOKUP(DATE($A$2,$A$3+$A$1-1,CE5),HolidayList[Date],1,0)))),TRUE,FALSE),FALSE)","v":false},{"$f":"IFERROR(IF(AND(VLOOKUP(CF6,$NR$11:$NS$17,2,0)=\"Yes\",NOT(ISNUMBER(VLOOKUP(DATE($A$2,$A$3+$A$1-1,CF5),HolidayList[Date],1,0)))),TRUE,FALSE),FALSE)","v":false},{"$f":"IFERROR(IF(AND(VLOOKUP(CG6,$NR$11:$NS$17,2,0)=\"Yes\",NOT(ISNUMBER(VLOOKUP(DATE($A$2,$A$3+$A$1-1,CG5),HolidayList[Date],1,0)))),TRUE,FALSE),FALSE)","v":false},{"$f":"IFERROR(IF(AND(VLOOKUP(CH6,$NR$11:$NS$17,2,0)=\"Yes\",NOT(ISNUMBER(VLOOKUP(DATE($A$2,$A$3+$A$1-1,CH5),HolidayList[Date],1,0)))),TRUE,FALSE),FALSE)","v":false},{"$f":"IFERROR(IF(AND(VLOOKUP(CI6,$NR$11:$NS$17,2,0)=\"Yes\",NOT(ISNUMBER(VLOOKUP(DATE($A$2,$A$3+$A$1-1,CI5),HolidayList[Date],1,0)))),TRUE,FALSE),FALSE)","v":false},{"$f":"IFERROR(IF(AND(VLOOKUP(CJ6,$NR$11:$NS$17,2,0)=\"Yes\",NOT(ISNUMBER(VLOOKUP(DATE($A$2,$A$3+$A$1-1,CJ5),HolidayList[Date],1,0)))),TRUE,FALSE),FALSE)","v":false},{"$f":"IFERROR(IF(AND(VLOOKUP(CK6,$NR$11:$NS$17,2,0)=\"Yes\",NOT(ISNUMBER(VLOOKUP(DATE($A$2,$A$3+$A$1-1,CK5),HolidayList[Date],1,0)))),TRUE,FALSE),FALSE)","v":false},{"$f":"IFERROR(IF(AND(VLOOKUP(CL6,$NR$11:$NS$17,2,0)=\"Yes\",NOT(ISNUMBER(VLOOKUP(DATE($A$2,$A$3+$A$1-1,CL5),HolidayList[Date],1,0)))),TRUE,FALSE),FALSE)","v":false},{"$f":"IFERROR(IF(AND(VLOOKUP(CM6,$NR$11:$NS$17,2,0)=\"Yes\",NOT(ISNUMBER(VLOOKUP(DATE($A$2,$A$3+$A$1-1,CM5),HolidayList[Date],1,0)))),TRUE,FALSE),FALSE)","v":false},{"$f":"IFERROR(IF(AND(VLOOKUP(CN6,$NR$11:$NS$17,2,0)=\"Yes\",NOT(ISNUMBER(VLOOKUP(DATE($A$2,$A$3+$A$1-1,CN5),HolidayList[Date],1,0)))),TRUE,FALSE),FALSE)","v":false},{"$f":"IFERROR(IF(AND(VLOOKUP(CO6,$NR$11:$NS$17,2,0)=\"Yes\",NOT(ISNUMBER(VLOOKUP(DATE($A$2,$A$3+$A$1-1,CO5),HolidayList[Date],1,0)))),TRUE,FALSE),FALSE)","v":false},{"$f":"IFERROR(IF(AND(VLOOKUP(CP6,$NR$11:$NS$17,2,0)=\"Yes\",NOT(ISNUMBER(VLOOKUP(DATE($A$2,$A$3+$A$1-1,CP5),HolidayList[Date],1,0)))),TRUE,FALSE),FALSE)","v":false},{"$f":"IFERROR(IF(AND(VLOOKUP(CQ6,$NR$11:$NS$17,2,0)=\"Yes\",NOT(ISNUMBER(VLOOKUP(DATE($A$2,$A$3+$A$1-1,CQ5),HolidayList[Date],1,0)))),TRUE,FALSE),FALSE)","v":false},{"$f":"IFERROR(IF(AND(VLOOKUP(CR6,$NR$11:$NS$17,2,0)=\"Yes\",NOT(ISNUMBER(VLOOKUP(DATE($A$2,$A$3+$A$1-1,CR5),HolidayList[Date],1,0)))),TRUE,FALSE),FALSE)","v":false},{"$f":"IFERROR(IF(AND(VLOOKUP(CS6,$NR$11:$NS$17,2,0)=\"Yes\",NOT(ISNUMBER(VLOOKUP(DATE($A$2,$A$3+$A$1-1,CS5),HolidayList[Date],1,0)))),TRUE,FALSE),FALSE)","v":false},{"$f":"IFERROR(IF(AND(VLOOKUP(CT6,$NR$11:$NS$17,2,0)=\"Yes\",NOT(ISNUMBER(VLOOKUP(DATE($A$2,$A$3+$A$1-1,CT5),HolidayList[Date],1,0)))),TRUE,FALSE),FALSE)","v":false},{"$f":"IFERROR(IF(AND(VLOOKUP(CU6,$NR$11:$NS$17,2,0)=\"Yes\",NOT(ISNUMBER(VLOOKUP(DATE($A$2,$A$3+$A$1-1,CU5),HolidayList[Date],1,0)))),TRUE,FALSE),FALSE)","v":false},{"$f":"IFERROR(IF(AND(VLOOKUP(CV6,$NR$11:$NS$17,2,0)=\"Yes\",NOT(ISNUMBER(VLOOKUP(DATE($A$2,$A$3+$A$1-1,CV5),HolidayList[Date],1,0)))),TRUE,FALSE),FALSE)","v":false},{"$f":"IFERROR(IF(AND(VLOOKUP(CW6,$NR$11:$NS$17,2,0)=\"Yes\",NOT(ISNUMBER(VLOOKUP(DATE($A$2,$A$3+$A$1-1,CW5),HolidayList[Date],1,0)))),TRUE,FALSE),FALSE)","v":false},{"$f":"IFERROR(IF(AND(VLOOKUP(CX6,$NR$11:$NS$17,2,0)=\"Yes\",NOT(ISNUMBER(VLOOKUP(DATE($A$2,$A$3+$A$1-1,CX5),HolidayList[Date],1,0)))),TRUE,FALSE),FALSE)","v":false},{"$f":"IFERROR(IF(AND(VLOOKUP(CY6,$NR$11:$NS$17,2,0)=\"Yes\",NOT(ISNUMBER(VLOOKUP(DATE($A$2,$A$3+$A$1-1,CY5),HolidayList[Date],1,0)))),TRUE,FALSE),FALSE)","v":false},{"$f":"IFERROR(IF(AND(VLOOKUP(CZ6,$NR$11:$NS$17,2,0)=\"Yes\",NOT(ISNUMBER(VLOOKUP(DATE($A$2,$A$3+$A$1-1,CZ5),HolidayList[Date],1,0)))),TRUE,FALSE),FALSE)","v":false},{"$f":"IFERROR(IF(AND(VLOOKUP(DA6,$NR$11:$NS$17,2,0)=\"Yes\",NOT(ISNUMBER(VLOOKUP(DATE($A$2,$A$3+$A$1-1,DA5),HolidayList[Date],1,0)))),TRUE,FALSE),FALSE)","v":false},{"$f":"IFERROR(IF(AND(VLOOKUP(DB6,$NR$11:$NS$17,2,0)=\"Yes\",NOT(ISNUMBER(VLOOKUP(DATE($A$2,$A$3+$A$1-1,DB5),HolidayList[Date],1,0)))),TRUE,FALSE),FALSE)","v":false},{"$f":"IFERROR(IF(AND(VLOOKUP(DC6,$NR$11:$NS$17,2,0)=\"Yes\",NOT(ISNUMBER(VLOOKUP(DATE($A$2,$A$3+$A$1-1,DC5),HolidayList[Date],1,0)))),TRUE,FALSE),FALSE)","v":false},{"$f":"IFERROR(IF(AND(VLOOKUP(DD6,$NR$11:$NS$17,2,0)=\"Yes\",NOT(ISNUMBER(VLOOKUP(DATE($A$2,$A$3+$A$1-1,DD5),HolidayList[Date],1,0)))),TRUE,FALSE),FALSE)","v":false},{"$f":"IFERROR(IF(AND(VLOOKUP(DE6,$NR$11:$NS$17,2,0)=\"Yes\",NOT(ISNUMBER(VLOOKUP(DATE($A$2,$A$3+$A$1-1,DE5),HolidayList[Date],1,0)))),TRUE,FALSE),FALSE)","v":false},{"$f":"IFERROR(IF(AND(VLOOKUP(DF6,$NR$11:$NS$17,2,0)=\"Yes\",NOT(ISNUMBER(VLOOKUP(DATE($A$2,$A$3+$A$1-1,DF5),HolidayList[Date],1,0)))),TRUE,FALSE),FALSE)","v":false},{"$f":"IFERROR(IF(AND(VLOOKUP(DG6,$NR$11:$NS$17,2,0)=\"Yes\",NOT(ISNUMBER(VLOOKUP(DATE($A$2,$A$3+$A$1-1,DG5),HolidayList[Date],1,0)))),TRUE,FALSE),FALSE)","v":false},{"$f":"IFERROR(IF(AND(VLOOKUP(DH6,$NR$11:$NS$17,2,0)=\"Yes\",NOT(ISNUMBER(VLOOKUP(DATE($A$2,$A$3+$A$1-1,DH5),HolidayList[Date],1,0)))),TRUE,FALSE),FALSE)","v":false},{"$f":"IFERROR(IF(AND(VLOOKUP(DI6,$NR$11:$NS$17,2,0)=\"Yes\",NOT(ISNUMBER(VLOOKUP(DATE($A$2,$A$3+$A$1-1,DI5),HolidayList[Date],1,0)))),TRUE,FALSE),FALSE)","v":false},{"$f":"IFERROR(IF(AND(VLOOKUP(DJ6,$NR$11:$NS$17,2,0)=\"Yes\",NOT(ISNUMBER(VLOOKUP(DATE($A$2,$A$3+$A$1-1,DJ5),HolidayList[Date],1,0)))),TRUE,FALSE),FALSE)","v":false},{"$f":"IFERROR(IF(AND(VLOOKUP(DK6,$NR$11:$NS$17,2,0)=\"Yes\",NOT(ISNUMBER(VLOOKUP(DATE($A$2,$A$3+$A$1-1,DK5),HolidayList[Date],1,0)))),TRUE,FALSE),FALSE)","v":false},{"$f":"IFERROR(IF(AND(VLOOKUP(DL6,$NR$11:$NS$17,2,0)=\"Yes\",NOT(ISNUMBER(VLOOKUP(DATE($A$2,$A$3+$A$1-1,DL5),HolidayList[Date],1,0)))),TRUE,FALSE),FALSE)","v":false},{"$f":"IFERROR(IF(AND(VLOOKUP(DM6,$NR$11:$NS$17,2,0)=\"Yes\",NOT(ISNUMBER(VLOOKUP(DATE($A$2,$A$3+$A$1-1,DM5),HolidayList[Date],1,0)))),TRUE,FALSE),FALSE)","v":false},{"$f":"IFERROR(IF(AND(VLOOKUP(DN6,$NR$11:$NS$17,2,0)=\"Yes\",NOT(ISNUMBER(VLOOKUP(DATE($A$2,$A$3+$A$1-1,DN5),HolidayList[Date],1,0)))),TRUE,FALSE),FALSE)","v":false},{"$f":"IFERROR(IF(AND(VLOOKUP(DO6,$NR$11:$NS$17,2,0)=\"Yes\",NOT(ISNUMBER(VLOOKUP(DATE($A$2,$A$3+$A$1-1,DO5),HolidayList[Date],1,0)))),TRUE,FALSE),FALSE)","v":false},{"$f":"IFERROR(IF(AND(VLOOKUP(DP6,$NR$11:$NS$17,2,0)=\"Yes\",NOT(ISNUMBER(VLOOKUP(DATE($A$2,$A$3+$A$1-1,DP5),HolidayList[Date],1,0)))),TRUE,FALSE),FALSE)","v":false},{"$f":"IFERROR(IF(AND(VLOOKUP(DQ6,$NR$11:$NS$17,2,0)=\"Yes\",NOT(ISNUMBER(VLOOKUP(DATE($A$2,$A$3+$A$1-1,DQ5),HolidayList[Date],1,0)))),TRUE,FALSE),FALSE)","v":false},{"$f":"IFERROR(IF(AND(VLOOKUP(DR6,$NR$11:$NS$17,2,0)=\"Yes\",NOT(ISNUMBER(VLOOKUP(DATE($A$2,$A$3+$A$1-1,DR5),HolidayList[Date],1,0)))),TRUE,FALSE),FALSE)","v":false},{"$f":"IFERROR(IF(AND(VLOOKUP(DS6,$NR$11:$NS$17,2,0)=\"Yes\",NOT(ISNUMBER(VLOOKUP(DATE($A$2,$A$3+$A$1-1,DS5),HolidayList[Date],1,0)))),TRUE,FALSE),FALSE)","v":false},{"$f":"IFERROR(IF(AND(VLOOKUP(DT6,$NR$11:$NS$17,2,0)=\"Yes\",NOT(ISNUMBER(VLOOKUP(DATE($A$2,$A$3+$A$1-1,DT5),HolidayList[Date],1,0)))),TRUE,FALSE),FALSE)","v":false},{"$f":"IFERROR(IF(AND(VLOOKUP(DU6,$NR$11:$NS$17,2,0)=\"Yes\",NOT(ISNUMBER(VLOOKUP(DATE($A$2,$A$3+$A$1-1,DU5),HolidayList[Date],1,0)))),TRUE,FALSE),FALSE)","v":false},{"$f":"IFERROR(IF(AND(VLOOKUP(DV6,$NR$11:$NS$17,2,0)=\"Yes\",NOT(ISNUMBER(VLOOKUP(DATE($A$2,$A$3+$A$1-1,DV5),HolidayList[Date],1,0)))),TRUE,FALSE),FALSE)","v":false},{"$f":"IFERROR(IF(AND(VLOOKUP(DW6,$NR$11:$NS$17,2,0)=\"Yes\",NOT(ISNUMBER(VLOOKUP(DATE($A$2,$A$3+$A$1-1,DW5),HolidayList[Date],1,0)))),TRUE,FALSE),FALSE)","v":false},{"$f":"IFERROR(IF(AND(VLOOKUP(DX6,$NR$11:$NS$17,2,0)=\"Yes\",NOT(ISNUMBER(VLOOKUP(DATE($A$2,$A$3+$A$1-1,DX5),HolidayList[Date],1,0)))),TRUE,FALSE),FALSE)","v":false},{"$f":"IFERROR(IF(AND(VLOOKUP(DY6,$NR$11:$NS$17,2,0)=\"Yes\",NOT(ISNUMBER(VLOOKUP(DATE($A$2,$A$3+$A$1-1,DY5),HolidayList[Date],1,0)))),TRUE,FALSE),FALSE)","v":false},{"$f":"IFERROR(IF(AND(VLOOKUP(DZ6,$NR$11:$NS$17,2,0)=\"Yes\",NOT(ISNUMBER(VLOOKUP(DATE($A$2,$A$3+$A$1-1,DZ5),HolidayList[Date],1,0)))),TRUE,FALSE),FALSE)","v":false},{"$f":"IFERROR(IF(AND(VLOOKUP(EA6,$NR$11:$NS$17,2,0)=\"Yes\",NOT(ISNUMBER(VLOOKUP(DATE($A$2,$A$3+$A$1-1,EA5),HolidayList[Date],1,0)))),TRUE,FALSE),FALSE)","v":false},{"$f":"IFERROR(IF(AND(VLOOKUP(EB6,$NR$11:$NS$17,2,0)=\"Yes\",NOT(ISNUMBER(VLOOKUP(DATE($A$2,$A$3+$A$1-1,EB5),HolidayList[Date],1,0)))),TRUE,FALSE),FALSE)","v":false},{"$f":"IFERROR(IF(AND(VLOOKUP(EC6,$NR$11:$NS$17,2,0)=\"Yes\",NOT(ISNUMBER(VLOOKUP(DATE($A$2,$A$3+$A$1-1,EC5),HolidayList[Date],1,0)))),TRUE,FALSE),FALSE)","v":false},{"$f":"IFERROR(IF(AND(VLOOKUP(ED6,$NR$11:$NS$17,2,0)=\"Yes\",NOT(ISNUMBER(VLOOKUP(DATE($A$2,$A$3+$A$1-1,ED5),HolidayList[Date],1,0)))),TRUE,FALSE),FALSE)","v":false},{"$f":"IFERROR(IF(AND(VLOOKUP(EE6,$NR$11:$NS$17,2,0)=\"Yes\",NOT(ISNUMBER(VLOOKUP(DATE($A$2,$A$3+$A$1-1,EE5),HolidayList[Date],1,0)))),TRUE,FALSE),FALSE)","v":false},{"$f":"IFERROR(IF(AND(VLOOKUP(EF6,$NR$11:$NS$17,2,0)=\"Yes\",NOT(ISNUMBER(VLOOKUP(DATE($A$2,$A$3+$A$1-1,EF5),HolidayList[Date],1,0)))),TRUE,FALSE),FALSE)","v":false},{"$f":"IFERROR(IF(AND(VLOOKUP(EG6,$NR$11:$NS$17,2,0)=\"Yes\",NOT(ISNUMBER(VLOOKUP(DATE($A$2,$A$3+$A$1-1,EG5),HolidayList[Date],1,0)))),TRUE,FALSE),FALSE)","v":false},{"$f":"IFERROR(IF(AND(VLOOKUP(EH6,$NR$11:$NS$17,2,0)=\"Yes\",NOT(ISNUMBER(VLOOKUP(DATE($A$2,$A$3+$A$1-1,EH5),HolidayList[Date],1,0)))),TRUE,FALSE),FALSE)","v":false},{"$f":"IFERROR(IF(AND(VLOOKUP(EI6,$NR$11:$NS$17,2,0)=\"Yes\",NOT(ISNUMBER(VLOOKUP(DATE($A$2,$A$3+$A$1-1,EI5),HolidayList[Date],1,0)))),TRUE,FALSE),FALSE)","v":false},{"$f":"IFERROR(IF(AND(VLOOKUP(EJ6,$NR$11:$NS$17,2,0)=\"Yes\",NOT(ISNUMBER(VLOOKUP(DATE($A$2,$A$3+$A$1-1,EJ5),HolidayList[Date],1,0)))),TRUE,FALSE),FALSE)","v":false},{"$f":"IFERROR(IF(AND(VLOOKUP(EK6,$NR$11:$NS$17,2,0)=\"Yes\",NOT(ISNUMBER(VLOOKUP(DATE($A$2,$A$3+$A$1-1,EK5),HolidayList[Date],1,0)))),TRUE,FALSE),FALSE)","v":false},{"$f":"IFERROR(IF(AND(VLOOKUP(EL6,$NR$11:$NS$17,2,0)=\"Yes\",NOT(ISNUMBER(VLOOKUP(DATE($A$2,$A$3+$A$1-1,EL5),HolidayList[Date],1,0)))),TRUE,FALSE),FALSE)","v":false},{"$f":"IFERROR(IF(AND(VLOOKUP(EM6,$NR$11:$NS$17,2,0)=\"Yes\",NOT(ISNUMBER(VLOOKUP(DATE($A$2,$A$3+$A$1-1,EM5),HolidayList[Date],1,0)))),TRUE,FALSE),FALSE)","v":false},{"$f":"IFERROR(IF(AND(VLOOKUP(EN6,$NR$11:$NS$17,2,0)=\"Yes\",NOT(ISNUMBER(VLOOKUP(DATE($A$2,$A$3+$A$1-1,EN5),HolidayList[Date],1,0)))),TRUE,FALSE),FALSE)","v":false},{"$f":"IFERROR(IF(AND(VLOOKUP(EO6,$NR$11:$NS$17,2,0)=\"Yes\",NOT(ISNUMBER(VLOOKUP(DATE($A$2,$A$3+$A$1-1,EO5),HolidayList[Date],1,0)))),TRUE,FALSE),FALSE)","v":false},{"$f":"IFERROR(IF(AND(VLOOKUP(EP6,$NR$11:$NS$17,2,0)=\"Yes\",NOT(ISNUMBER(VLOOKUP(DATE($A$2,$A$3+$A$1-1,EP5),HolidayList[Date],1,0)))),TRUE,FALSE),FALSE)","v":false},{"$f":"IFERROR(IF(AND(VLOOKUP(EQ6,$NR$11:$NS$17,2,0)=\"Yes\",NOT(ISNUMBER(VLOOKUP(DATE($A$2,$A$3+$A$1-1,EQ5),HolidayList[Date],1,0)))),TRUE,FALSE),FALSE)","v":false},{"$f":"IFERROR(IF(AND(VLOOKUP(ER6,$NR$11:$NS$17,2,0)=\"Yes\",NOT(ISNUMBER(VLOOKUP(DATE($A$2,$A$3+$A$1-1,ER5),HolidayList[Date],1,0)))),TRUE,FALSE),FALSE)","v":false},{"$f":"IFERROR(IF(AND(VLOOKUP(ES6,$NR$11:$NS$17,2,0)=\"Yes\",NOT(ISNUMBER(VLOOKUP(DATE($A$2,$A$3+$A$1-1,ES5),HolidayList[Date],1,0)))),TRUE,FALSE),FALSE)","v":false},{"$f":"IFERROR(IF(AND(VLOOKUP(ET6,$NR$11:$NS$17,2,0)=\"Yes\",NOT(ISNUMBER(VLOOKUP(DATE($A$2,$A$3+$A$1-1,ET5),HolidayList[Date],1,0)))),TRUE,FALSE),FALSE)","v":false},{"$f":"IFERROR(IF(AND(VLOOKUP(EU6,$NR$11:$NS$17,2,0)=\"Yes\",NOT(ISNUMBER(VLOOKUP(DATE($A$2,$A$3+$A$1-1,EU5),HolidayList[Date],1,0)))),TRUE,FALSE),FALSE)","v":false},{"$f":"IFERROR(IF(AND(VLOOKUP(EV6,$NR$11:$NS$17,2,0)=\"Yes\",NOT(ISNUMBER(VLOOKUP(DATE($A$2,$A$3+$A$1-1,EV5),HolidayList[Date],1,0)))),TRUE,FALSE),FALSE)","v":false},{"$f":"IFERROR(IF(AND(VLOOKUP(EW6,$NR$11:$NS$17,2,0)=\"Yes\",NOT(ISNUMBER(VLOOKUP(DATE($A$2,$A$3+$A$1-1,EW5),HolidayList[Date],1,0)))),TRUE,FALSE),FALSE)","v":false},{"$f":"IFERROR(IF(AND(VLOOKUP(EX6,$NR$11:$NS$17,2,0)=\"Yes\",NOT(ISNUMBER(VLOOKUP(DATE($A$2,$A$3+$A$1-1,EX5),HolidayList[Date],1,0)))),TRUE,FALSE),FALSE)","v":false},{"$f":"IFERROR(IF(AND(VLOOKUP(EY6,$NR$11:$NS$17,2,0)=\"Yes\",NOT(ISNUMBER(VLOOKUP(DATE($A$2,$A$3+$A$1-1,EY5),HolidayList[Date],1,0)))),TRUE,FALSE),FALSE)","v":false},{"$f":"IFERROR(IF(AND(VLOOKUP(EZ6,$NR$11:$NS$17,2,0)=\"Yes\",NOT(ISNUMBER(VLOOKUP(DATE($A$2,$A$3+$A$1-1,EZ5),HolidayList[Date],1,0)))),TRUE,FALSE),FALSE)","v":false},{"$f":"IFERROR(IF(AND(VLOOKUP(FA6,$NR$11:$NS$17,2,0)=\"Yes\",NOT(ISNUMBER(VLOOKUP(DATE($A$2,$A$3+$A$1-1,FA5),HolidayList[Date],1,0)))),TRUE,FALSE),FALSE)","v":false},{"$f":"IFERROR(IF(AND(VLOOKUP(FB6,$NR$11:$NS$17,2,0)=\"Yes\",NOT(ISNUMBER(VLOOKUP(DATE($A$2,$A$3+$A$1-1,FB5),HolidayList[Date],1,0)))),TRUE,FALSE),FALSE)","v":false},{"$f":"IFERROR(IF(AND(VLOOKUP(FC6,$NR$11:$NS$17,2,0)=\"Yes\",NOT(ISNUMBER(VLOOKUP(DATE($A$2,$A$3+$A$1-1,FC5),HolidayList[Date],1,0)))),TRUE,FALSE),FALSE)","v":false},{"$f":"IFERROR(IF(AND(VLOOKUP(FD6,$NR$11:$NS$17,2,0)=\"Yes\",NOT(ISNUMBER(VLOOKUP(DATE($A$2,$A$3+$A$1-1,FD5),HolidayList[Date],1,0)))),TRUE,FALSE),FALSE)","v":false},{"$f":"IFERROR(IF(AND(VLOOKUP(FE6,$NR$11:$NS$17,2,0)=\"Yes\",NOT(ISNUMBER(VLOOKUP(DATE($A$2,$A$3+$A$1-1,FE5),HolidayList[Date],1,0)))),TRUE,FALSE),FALSE)","v":false},{"$f":"IFERROR(IF(AND(VLOOKUP(FF6,$NR$11:$NS$17,2,0)=\"Yes\",NOT(ISNUMBER(VLOOKUP(DATE($A$2,$A$3+$A$1-1,FF5),HolidayList[Date],1,0)))),TRUE,FALSE),FALSE)","v":false},{"$f":"IFERROR(IF(AND(VLOOKUP(FG6,$NR$11:$NS$17,2,0)=\"Yes\",NOT(ISNUMBER(VLOOKUP(DATE($A$2,$A$3+$A$1-1,FG5),HolidayList[Date],1,0)))),TRUE,FALSE),FALSE)","v":false},{"$f":"IFERROR(IF(AND(VLOOKUP(FH6,$NR$11:$NS$17,2,0)=\"Yes\",NOT(ISNUMBER(VLOOKUP(DATE($A$2,$A$3+$A$1-1,FH5),HolidayList[Date],1,0)))),TRUE,FALSE),FALSE)","v":false},{"$f":"IFERROR(IF(AND(VLOOKUP(FI6,$NR$11:$NS$17,2,0)=\"Yes\",NOT(ISNUMBER(VLOOKUP(DATE($A$2,$A$3+$A$1-1,FI5),HolidayList[Date],1,0)))),TRUE,FALSE),FALSE)","v":false},{"$f":"IFERROR(IF(AND(VLOOKUP(FJ6,$NR$11:$NS$17,2,0)=\"Yes\",NOT(ISNUMBER(VLOOKUP(DATE($A$2,$A$3+$A$1-1,FJ5),HolidayList[Date],1,0)))),TRUE,FALSE),FALSE)","v":false},{"$f":"IFERROR(IF(AND(VLOOKUP(FK6,$NR$11:$NS$17,2,0)=\"Yes\",NOT(ISNUMBER(VLOOKUP(DATE($A$2,$A$3+$A$1-1,FK5),HolidayList[Date],1,0)))),TRUE,FALSE),FALSE)","v":false},{"$f":"IFERROR(IF(AND(VLOOKUP(FL6,$NR$11:$NS$17,2,0)=\"Yes\",NOT(ISNUMBER(VLOOKUP(DATE($A$2,$A$3+$A$1-1,FL5),HolidayList[Date],1,0)))),TRUE,FALSE),FALSE)","v":false},{"$f":"IFERROR(IF(AND(VLOOKUP(FM6,$NR$11:$NS$17,2,0)=\"Yes\",NOT(ISNUMBER(VLOOKUP(DATE($A$2,$A$3+$A$1-1,FM5),HolidayList[Date],1,0)))),TRUE,FALSE),FALSE)","v":false},{"$f":"IFERROR(IF(AND(VLOOKUP(FN6,$NR$11:$NS$17,2,0)=\"Yes\",NOT(ISNUMBER(VLOOKUP(DATE($A$2,$A$3+$A$1-1,FN5),HolidayList[Date],1,0)))),TRUE,FALSE),FALSE)","v":false},{"$f":"IFERROR(IF(AND(VLOOKUP(FO6,$NR$11:$NS$17,2,0)=\"Yes\",NOT(ISNUMBER(VLOOKUP(DATE($A$2,$A$3+$A$1-1,FO5),HolidayList[Date],1,0)))),TRUE,FALSE),FALSE)","v":false},{"$f":"IFERROR(IF(AND(VLOOKUP(FP6,$NR$11:$NS$17,2,0)=\"Yes\",NOT(ISNUMBER(VLOOKUP(DATE($A$2,$A$3+$A$1-1,FP5),HolidayList[Date],1,0)))),TRUE,FALSE),FALSE)","v":false},{"$f":"IFERROR(IF(AND(VLOOKUP(FQ6,$NR$11:$NS$17,2,0)=\"Yes\",NOT(ISNUMBER(VLOOKUP(DATE($A$2,$A$3+$A$1-1,FQ5),HolidayList[Date],1,0)))),TRUE,FALSE),FALSE)","v":false},{"$f":"IFERROR(IF(AND(VLOOKUP(FR6,$NR$11:$NS$17,2,0)=\"Yes\",NOT(ISNUMBER(VLOOKUP(DATE($A$2,$A$3+$A$1-1,FR5),HolidayList[Date],1,0)))),TRUE,FALSE),FALSE)","v":false},{"$f":"IFERROR(IF(AND(VLOOKUP(FS6,$NR$11:$NS$17,2,0)=\"Yes\",NOT(ISNUMBER(VLOOKUP(DATE($A$2,$A$3+$A$1-1,FS5),HolidayList[Date],1,0)))),TRUE,FALSE),FALSE)","v":false},{"$f":"IFERROR(IF(AND(VLOOKUP(FT6,$NR$11:$NS$17,2,0)=\"Yes\",NOT(ISNUMBER(VLOOKUP(DATE($A$2,$A$3+$A$1-1,FT5),HolidayList[Date],1,0)))),TRUE,FALSE),FALSE)","v":false},{"$f":"IFERROR(IF(AND(VLOOKUP(FU6,$NR$11:$NS$17,2,0)=\"Yes\",NOT(ISNUMBER(VLOOKUP(DATE($A$2,$A$3+$A$1-1,FU5),HolidayList[Date],1,0)))),TRUE,FALSE),FALSE)","v":false},{"$f":"IFERROR(IF(AND(VLOOKUP(FV6,$NR$11:$NS$17,2,0)=\"Yes\",NOT(ISNUMBER(VLOOKUP(DATE($A$2,$A$3+$A$1-1,FV5),HolidayList[Date],1,0)))),TRUE,FALSE),FALSE)","v":false},{"$f":"IFERROR(IF(AND(VLOOKUP(FW6,$NR$11:$NS$17,2,0)=\"Yes\",NOT(ISNUMBER(VLOOKUP(DATE($A$2,$A$3+$A$1-1,FW5),HolidayList[Date],1,0)))),TRUE,FALSE),FALSE)","v":false},{"$f":"IFERROR(IF(AND(VLOOKUP(FX6,$NR$11:$NS$17,2,0)=\"Yes\",NOT(ISNUMBER(VLOOKUP(DATE($A$2,$A$3+$A$1-1,FX5),HolidayList[Date],1,0)))),TRUE,FALSE),FALSE)","v":false},{"$f":"IFERROR(IF(AND(VLOOKUP(FY6,$NR$11:$NS$17,2,0)=\"Yes\",NOT(ISNUMBER(VLOOKUP(DATE($A$2,$A$3+$A$1-1,FY5),HolidayList[Date],1,0)))),TRUE,FALSE),FALSE)","v":false},{"$f":"IFERROR(IF(AND(VLOOKUP(FZ6,$NR$11:$NS$17,2,0)=\"Yes\",NOT(ISNUMBER(VLOOKUP(DATE($A$2,$A$3+$A$1-1,FZ5),HolidayList[Date],1,0)))),TRUE,FALSE),FALSE)","v":false},{"$f":"IFERROR(IF(AND(VLOOKUP(GA6,$NR$11:$NS$17,2,0)=\"Yes\",NOT(ISNUMBER(VLOOKUP(DATE($A$2,$A$3+$A$1-1,GA5),HolidayList[Date],1,0)))),TRUE,FALSE),FALSE)","v":false},{"$f":"IFERROR(IF(AND(VLOOKUP(GB6,$NR$11:$NS$17,2,0)=\"Yes\",NOT(ISNUMBER(VLOOKUP(DATE($A$2,$A$3+$A$1-1,GB5),HolidayList[Date],1,0)))),TRUE,FALSE),FALSE)","v":false},{"$f":"IFERROR(IF(AND(VLOOKUP(GC6,$NR$11:$NS$17,2,0)=\"Yes\",NOT(ISNUMBER(VLOOKUP(DATE($A$2,$A$3+$A$1-1,GC5),HolidayList[Date],1,0)))),TRUE,FALSE),FALSE)","v":false},{"$f":"IFERROR(IF(AND(VLOOKUP(GD6,$NR$11:$NS$17,2,0)=\"Yes\",NOT(ISNUMBER(VLOOKUP(DATE($A$2,$A$3+$A$1-1,GD5),HolidayList[Date],1,0)))),TRUE,FALSE),FALSE)","v":false},{"$f":"IFERROR(IF(AND(VLOOKUP(GE6,$NR$11:$NS$17,2,0)=\"Yes\",NOT(ISNUMBER(VLOOKUP(DATE($A$2,$A$3+$A$1-1,GE5),HolidayList[Date],1,0)))),TRUE,FALSE),FALSE)","v":false},{"$f":"IFERROR(IF(AND(VLOOKUP(GF6,$NR$11:$NS$17,2,0)=\"Yes\",NOT(ISNUMBER(VLOOKUP(DATE($A$2,$A$3+$A$1-1,GF5),HolidayList[Date],1,0)))),TRUE,FALSE),FALSE)","v":false},{"$f":"IFERROR(IF(AND(VLOOKUP(GG6,$NR$11:$NS$17,2,0)=\"Yes\",NOT(ISNUMBER(VLOOKUP(DATE($A$2,$A$3+$A$1-1,GG5),HolidayList[Date],1,0)))),TRUE,FALSE),FALSE)","v":false},{"$f":"IFERROR(IF(AND(VLOOKUP(GH6,$NR$11:$NS$17,2,0)=\"Yes\",NOT(ISNUMBER(VLOOKUP(DATE($A$2,$A$3+$A$1-1,GH5),HolidayList[Date],1,0)))),TRUE,FALSE),FALSE)","v":false},{"$f":"IFERROR(IF(AND(VLOOKUP(GI6,$NR$11:$NS$17,2,0)=\"Yes\",NOT(ISNUMBER(VLOOKUP(DATE($A$2,$A$3+$A$1-1,GI5),HolidayList[Date],1,0)))),TRUE,FALSE),FALSE)","v":false},{"$f":"IFERROR(IF(AND(VLOOKUP(GJ6,$NR$11:$NS$17,2,0)=\"Yes\",NOT(ISNUMBER(VLOOKUP(DATE($A$2,$A$3+$A$1-1,GJ5),HolidayList[Date],1,0)))),TRUE,FALSE),FALSE)","v":false},{"$f":"IFERROR(IF(AND(VLOOKUP(GK6,$NR$11:$NS$17,2,0)=\"Yes\",NOT(ISNUMBER(VLOOKUP(DATE($A$2,$A$3+$A$1-1,GK5),HolidayList[Date],1,0)))),TRUE,FALSE),FALSE)","v":false},{"$f":"IFERROR(IF(AND(VLOOKUP(GL6,$NR$11:$NS$17,2,0)=\"Yes\",NOT(ISNUMBER(VLOOKUP(DATE($A$2,$A$3+$A$1-1,GL5),HolidayList[Date],1,0)))),TRUE,FALSE),FALSE)","v":false},{"$f":"IFERROR(IF(AND(VLOOKUP(GM6,$NR$11:$NS$17,2,0)=\"Yes\",NOT(ISNUMBER(VLOOKUP(DATE($A$2,$A$3+$A$1-1,GM5),HolidayList[Date],1,0)))),TRUE,FALSE),FALSE)","v":false},{"$f":"IFERROR(IF(AND(VLOOKUP(GN6,$NR$11:$NS$17,2,0)=\"Yes\",NOT(ISNUMBER(VLOOKUP(DATE($A$2,$A$3+$A$1-1,GN5),HolidayList[Date],1,0)))),TRUE,FALSE),FALSE)","v":false},{"$f":"IFERROR(IF(AND(VLOOKUP(GO6,$NR$11:$NS$17,2,0)=\"Yes\",NOT(ISNUMBER(VLOOKUP(DATE($A$2,$A$3+$A$1-1,GO5),HolidayList[Date],1,0)))),TRUE,FALSE),FALSE)","v":false},{"$f":"IFERROR(IF(AND(VLOOKUP(GP6,$NR$11:$NS$17,2,0)=\"Yes\",NOT(ISNUMBER(VLOOKUP(DATE($A$2,$A$3+$A$1-1,GP5),HolidayList[Date],1,0)))),TRUE,FALSE),FALSE)","v":false},{"$f":"IFERROR(IF(AND(VLOOKUP(GQ6,$NR$11:$NS$17,2,0)=\"Yes\",NOT(ISNUMBER(VLOOKUP(DATE($A$2,$A$3+$A$1-1,GQ5),HolidayList[Date],1,0)))),TRUE,FALSE),FALSE)","v":false},{"$f":"IFERROR(IF(AND(VLOOKUP(GR6,$NR$11:$NS$17,2,0)=\"Yes\",NOT(ISNUMBER(VLOOKUP(DATE($A$2,$A$3+$A$1-1,GR5),HolidayList[Date],1,0)))),TRUE,FALSE),FALSE)","v":false},{"$f":"IFERROR(IF(AND(VLOOKUP(GS6,$NR$11:$NS$17,2,0)=\"Yes\",NOT(ISNUMBER(VLOOKUP(DATE($A$2,$A$3+$A$1-1,GS5),HolidayList[Date],1,0)))),TRUE,FALSE),FALSE)","v":false},{"$f":"IFERROR(IF(AND(VLOOKUP(GT6,$NR$11:$NS$17,2,0)=\"Yes\",NOT(ISNUMBER(VLOOKUP(DATE($A$2,$A$3+$A$1-1,GT5),HolidayList[Date],1,0)))),TRUE,FALSE),FALSE)","v":false},{"$f":"IFERROR(IF(AND(VLOOKUP(GU6,$NR$11:$NS$17,2,0)=\"Yes\",NOT(ISNUMBER(VLOOKUP(DATE($A$2,$A$3+$A$1-1,GU5),HolidayList[Date],1,0)))),TRUE,FALSE),FALSE)","v":false},{"$f":"IFERROR(IF(AND(VLOOKUP(GV6,$NR$11:$NS$17,2,0)=\"Yes\",NOT(ISNUMBER(VLOOKUP(DATE($A$2,$A$3+$A$1-1,GV5),HolidayList[Date],1,0)))),TRUE,FALSE),FALSE)","v":false},{"$f":"IFERROR(IF(AND(VLOOKUP(GW6,$NR$11:$NS$17,2,0)=\"Yes\",NOT(ISNUMBER(VLOOKUP(DATE($A$2,$A$3+$A$1-1,GW5),HolidayList[Date],1,0)))),TRUE,FALSE),FALSE)","v":false},{"$f":"IFERROR(IF(AND(VLOOKUP(GX6,$NR$11:$NS$17,2,0)=\"Yes\",NOT(ISNUMBER(VLOOKUP(DATE($A$2,$A$3+$A$1-1,GX5),HolidayList[Date],1,0)))),TRUE,FALSE),FALSE)","v":false},{"$f":"IFERROR(IF(AND(VLOOKUP(GY6,$NR$11:$NS$17,2,0)=\"Yes\",NOT(ISNUMBER(VLOOKUP(DATE($A$2,$A$3+$A$1-1,GY5),HolidayList[Date],1,0)))),TRUE,FALSE),FALSE)","v":false},{"$f":"IFERROR(IF(AND(VLOOKUP(GZ6,$NR$11:$NS$17,2,0)=\"Yes\",NOT(ISNUMBER(VLOOKUP(DATE($A$2,$A$3+$A$1-1,GZ5),HolidayList[Date],1,0)))),TRUE,FALSE),FALSE)","v":false},{"$f":"IFERROR(IF(AND(VLOOKUP(HA6,$NR$11:$NS$17,2,0)=\"Yes\",NOT(ISNUMBER(VLOOKUP(DATE($A$2,$A$3+$A$1-1,HA5),HolidayList[Date],1,0)))),TRUE,FALSE),FALSE)","v":false},{"$f":"IFERROR(IF(AND(VLOOKUP(HB6,$NR$11:$NS$17,2,0)=\"Yes\",NOT(ISNUMBER(VLOOKUP(DATE($A$2,$A$3+$A$1-1,HB5),HolidayList[Date],1,0)))),TRUE,FALSE),FALSE)","v":false},{"$f":"IFERROR(IF(AND(VLOOKUP(HC6,$NR$11:$NS$17,2,0)=\"Yes\",NOT(ISNUMBER(VLOOKUP(DATE($A$2,$A$3+$A$1-1,HC5),HolidayList[Date],1,0)))),TRUE,FALSE),FALSE)","v":false},{"$f":"IFERROR(IF(AND(VLOOKUP(HD6,$NR$11:$NS$17,2,0)=\"Yes\",NOT(ISNUMBER(VLOOKUP(DATE($A$2,$A$3+$A$1-1,HD5),HolidayList[Date],1,0)))),TRUE,FALSE),FALSE)","v":false},{"$f":"IFERROR(IF(AND(VLOOKUP(HE6,$NR$11:$NS$17,2,0)=\"Yes\",NOT(ISNUMBER(VLOOKUP(DATE($A$2,$A$3+$A$1-1,HE5),HolidayList[Date],1,0)))),TRUE,FALSE),FALSE)","v":false},{"$f":"IFERROR(IF(AND(VLOOKUP(HF6,$NR$11:$NS$17,2,0)=\"Yes\",NOT(ISNUMBER(VLOOKUP(DATE($A$2,$A$3+$A$1-1,HF5),HolidayList[Date],1,0)))),TRUE,FALSE),FALSE)","v":false},{"$f":"IFERROR(IF(AND(VLOOKUP(HG6,$NR$11:$NS$17,2,0)=\"Yes\",NOT(ISNUMBER(VLOOKUP(DATE($A$2,$A$3+$A$1-1,HG5),HolidayList[Date],1,0)))),TRUE,FALSE),FALSE)","v":false},{"$f":"IFERROR(IF(AND(VLOOKUP(HH6,$NR$11:$NS$17,2,0)=\"Yes\",NOT(ISNUMBER(VLOOKUP(DATE($A$2,$A$3+$A$1-1,HH5),HolidayList[Date],1,0)))),TRUE,FALSE),FALSE)","v":false},{"$f":"IFERROR(IF(AND(VLOOKUP(HI6,$NR$11:$NS$17,2,0)=\"Yes\",NOT(ISNUMBER(VLOOKUP(DATE($A$2,$A$3+$A$1-1,HI5),HolidayList[Date],1,0)))),TRUE,FALSE),FALSE)","v":false},{"$f":"IFERROR(IF(AND(VLOOKUP(HJ6,$NR$11:$NS$17,2,0)=\"Yes\",NOT(ISNUMBER(VLOOKUP(DATE($A$2,$A$3+$A$1-1,HJ5),HolidayList[Date],1,0)))),TRUE,FALSE),FALSE)","v":false},{"$f":"IFERROR(IF(AND(VLOOKUP(HK6,$NR$11:$NS$17,2,0)=\"Yes\",NOT(ISNUMBER(VLOOKUP(DATE($A$2,$A$3+$A$1-1,HK5),HolidayList[Date],1,0)))),TRUE,FALSE),FALSE)","v":false},{"$f":"IFERROR(IF(AND(VLOOKUP(HL6,$NR$11:$NS$17,2,0)=\"Yes\",NOT(ISNUMBER(VLOOKUP(DATE($A$2,$A$3+$A$1-1,HL5),HolidayList[Date],1,0)))),TRUE,FALSE),FALSE)","v":false},{"$f":"IFERROR(IF(AND(VLOOKUP(HM6,$NR$11:$NS$17,2,0)=\"Yes\",NOT(ISNUMBER(VLOOKUP(DATE($A$2,$A$3+$A$1-1,HM5),HolidayList[Date],1,0)))),TRUE,FALSE),FALSE)","v":false},{"$f":"IFERROR(IF(AND(VLOOKUP(HN6,$NR$11:$NS$17,2,0)=\"Yes\",NOT(ISNUMBER(VLOOKUP(DATE($A$2,$A$3+$A$1-1,HN5),HolidayList[Date],1,0)))),TRUE,FALSE),FALSE)","v":false},{"$f":"IFERROR(IF(AND(VLOOKUP(HO6,$NR$11:$NS$17,2,0)=\"Yes\",NOT(ISNUMBER(VLOOKUP(DATE($A$2,$A$3+$A$1-1,HO5),HolidayList[Date],1,0)))),TRUE,FALSE),FALSE)","v":false},{"$f":"IFERROR(IF(AND(VLOOKUP(HP6,$NR$11:$NS$17,2,0)=\"Yes\",NOT(ISNUMBER(VLOOKUP(DATE($A$2,$A$3+$A$1-1,HP5),HolidayList[Date],1,0)))),TRUE,FALSE),FALSE)","v":false},{"$f":"IFERROR(IF(AND(VLOOKUP(HQ6,$NR$11:$NS$17,2,0)=\"Yes\",NOT(ISNUMBER(VLOOKUP(DATE($A$2,$A$3+$A$1-1,HQ5),HolidayList[Date],1,0)))),TRUE,FALSE),FALSE)","v":false},{"$f":"IFERROR(IF(AND(VLOOKUP(HR6,$NR$11:$NS$17,2,0)=\"Yes\",NOT(ISNUMBER(VLOOKUP(DATE($A$2,$A$3+$A$1-1,HR5),HolidayList[Date],1,0)))),TRUE,FALSE),FALSE)","v":false},{"$f":"IFERROR(IF(AND(VLOOKUP(HS6,$NR$11:$NS$17,2,0)=\"Yes\",NOT(ISNUMBER(VLOOKUP(DATE($A$2,$A$3+$A$1-1,HS5),HolidayList[Date],1,0)))),TRUE,FALSE),FALSE)","v":false},{"$f":"IFERROR(IF(AND(VLOOKUP(HT6,$NR$11:$NS$17,2,0)=\"Yes\",NOT(ISNUMBER(VLOOKUP(DATE($A$2,$A$3+$A$1-1,HT5),HolidayList[Date],1,0)))),TRUE,FALSE),FALSE)","v":false},{"$f":"IFERROR(IF(AND(VLOOKUP(HU6,$NR$11:$NS$17,2,0)=\"Yes\",NOT(ISNUMBER(VLOOKUP(DATE($A$2,$A$3+$A$1-1,HU5),HolidayList[Date],1,0)))),TRUE,FALSE),FALSE)","v":false},{"$f":"IFERROR(IF(AND(VLOOKUP(HV6,$NR$11:$NS$17,2,0)=\"Yes\",NOT(ISNUMBER(VLOOKUP(DATE($A$2,$A$3+$A$1-1,HV5),HolidayList[Date],1,0)))),TRUE,FALSE),FALSE)","v":false},{"$f":"IFERROR(IF(AND(VLOOKUP(HW6,$NR$11:$NS$17,2,0)=\"Yes\",NOT(ISNUMBER(VLOOKUP(DATE($A$2,$A$3+$A$1-1,HW5),HolidayList[Date],1,0)))),TRUE,FALSE),FALSE)","v":false},{"$f":"IFERROR(IF(AND(VLOOKUP(HX6,$NR$11:$NS$17,2,0)=\"Yes\",NOT(ISNUMBER(VLOOKUP(DATE($A$2,$A$3+$A$1-1,HX5),HolidayList[Date],1,0)))),TRUE,FALSE),FALSE)","v":false},{"$f":"IFERROR(IF(AND(VLOOKUP(HY6,$NR$11:$NS$17,2,0)=\"Yes\",NOT(ISNUMBER(VLOOKUP(DATE($A$2,$A$3+$A$1-1,HY5),HolidayList[Date],1,0)))),TRUE,FALSE),FALSE)","v":false},{"$f":"IFERROR(IF(AND(VLOOKUP(HZ6,$NR$11:$NS$17,2,0)=\"Yes\",NOT(ISNUMBER(VLOOKUP(DATE($A$2,$A$3+$A$1-1,HZ5),HolidayList[Date],1,0)))),TRUE,FALSE),FALSE)","v":false},{"$f":"IFERROR(IF(AND(VLOOKUP(IA6,$NR$11:$NS$17,2,0)=\"Yes\",NOT(ISNUMBER(VLOOKUP(DATE($A$2,$A$3+$A$1-1,IA5),HolidayList[Date],1,0)))),TRUE,FALSE),FALSE)","v":false},{"$f":"IFERROR(IF(AND(VLOOKUP(IB6,$NR$11:$NS$17,2,0)=\"Yes\",NOT(ISNUMBER(VLOOKUP(DATE($A$2,$A$3+$A$1-1,IB5),HolidayList[Date],1,0)))),TRUE,FALSE),FALSE)","v":false},{"$f":"IFERROR(IF(AND(VLOOKUP(IC6,$NR$11:$NS$17,2,0)=\"Yes\",NOT(ISNUMBER(VLOOKUP(DATE($A$2,$A$3+$A$1-1,IC5),HolidayList[Date],1,0)))),TRUE,FALSE),FALSE)","v":false},{"$f":"IFERROR(IF(AND(VLOOKUP(ID6,$NR$11:$NS$17,2,0)=\"Yes\",NOT(ISNUMBER(VLOOKUP(DATE($A$2,$A$3+$A$1-1,ID5),HolidayList[Date],1,0)))),TRUE,FALSE),FALSE)","v":false},{"$f":"IFERROR(IF(AND(VLOOKUP(IE6,$NR$11:$NS$17,2,0)=\"Yes\",NOT(ISNUMBER(VLOOKUP(DATE($A$2,$A$3+$A$1-1,IE5),HolidayList[Date],1,0)))),TRUE,FALSE),FALSE)","v":false},{"$f":"IFERROR(IF(AND(VLOOKUP(IF6,$NR$11:$NS$17,2,0)=\"Yes\",NOT(ISNUMBER(VLOOKUP(DATE($A$2,$A$3+$A$1-1,IF5),HolidayList[Date],1,0)))),TRUE,FALSE),FALSE)","v":false},{"$f":"IFERROR(IF(AND(VLOOKUP(IG6,$NR$11:$NS$17,2,0)=\"Yes\",NOT(ISNUMBER(VLOOKUP(DATE($A$2,$A$3+$A$1-1,IG5),HolidayList[Date],1,0)))),TRUE,FALSE),FALSE)","v":false},{"$f":"IFERROR(IF(AND(VLOOKUP(IH6,$NR$11:$NS$17,2,0)=\"Yes\",NOT(ISNUMBER(VLOOKUP(DATE($A$2,$A$3+$A$1-1,IH5),HolidayList[Date],1,0)))),TRUE,FALSE),FALSE)","v":false},{"$f":"IFERROR(IF(AND(VLOOKUP(II6,$NR$11:$NS$17,2,0)=\"Yes\",NOT(ISNUMBER(VLOOKUP(DATE($A$2,$A$3+$A$1-1,II5),HolidayList[Date],1,0)))),TRUE,FALSE),FALSE)","v":false},{"$f":"IFERROR(IF(AND(VLOOKUP(IJ6,$NR$11:$NS$17,2,0)=\"Yes\",NOT(ISNUMBER(VLOOKUP(DATE($A$2,$A$3+$A$1-1,IJ5),HolidayList[Date],1,0)))),TRUE,FALSE),FALSE)","v":false},{"$f":"IFERROR(IF(AND(VLOOKUP(IK6,$NR$11:$NS$17,2,0)=\"Yes\",NOT(ISNUMBER(VLOOKUP(DATE($A$2,$A$3+$A$1-1,IK5),HolidayList[Date],1,0)))),TRUE,FALSE),FALSE)","v":false},{"$f":"IFERROR(IF(AND(VLOOKUP(IL6,$NR$11:$NS$17,2,0)=\"Yes\",NOT(ISNUMBER(VLOOKUP(DATE($A$2,$A$3+$A$1-1,IL5),HolidayList[Date],1,0)))),TRUE,FALSE),FALSE)","v":false},{"$f":"IFERROR(IF(AND(VLOOKUP(IM6,$NR$11:$NS$17,2,0)=\"Yes\",NOT(ISNUMBER(VLOOKUP(DATE($A$2,$A$3+$A$1-1,IM5),HolidayList[Date],1,0)))),TRUE,FALSE),FALSE)","v":false},{"$f":"IFERROR(IF(AND(VLOOKUP(IN6,$NR$11:$NS$17,2,0)=\"Yes\",NOT(ISNUMBER(VLOOKUP(DATE($A$2,$A$3+$A$1-1,IN5),HolidayList[Date],1,0)))),TRUE,FALSE),FALSE)","v":false},{"$f":"IFERROR(IF(AND(VLOOKUP(IO6,$NR$11:$NS$17,2,0)=\"Yes\",NOT(ISNUMBER(VLOOKUP(DATE($A$2,$A$3+$A$1-1,IO5),HolidayList[Date],1,0)))),TRUE,FALSE),FALSE)","v":false},{"$f":"IFERROR(IF(AND(VLOOKUP(IP6,$NR$11:$NS$17,2,0)=\"Yes\",NOT(ISNUMBER(VLOOKUP(DATE($A$2,$A$3+$A$1-1,IP5),HolidayList[Date],1,0)))),TRUE,FALSE),FALSE)","v":false},{"$f":"IFERROR(IF(AND(VLOOKUP(IQ6,$NR$11:$NS$17,2,0)=\"Yes\",NOT(ISNUMBER(VLOOKUP(DATE($A$2,$A$3+$A$1-1,IQ5),HolidayList[Date],1,0)))),TRUE,FALSE),FALSE)","v":false},{"$f":"IFERROR(IF(AND(VLOOKUP(IR6,$NR$11:$NS$17,2,0)=\"Yes\",NOT(ISNUMBER(VLOOKUP(DATE($A$2,$A$3+$A$1-1,IR5),HolidayList[Date],1,0)))),TRUE,FALSE),FALSE)","v":false},{"$f":"IFERROR(IF(AND(VLOOKUP(IS6,$NR$11:$NS$17,2,0)=\"Yes\",NOT(ISNUMBER(VLOOKUP(DATE($A$2,$A$3+$A$1-1,IS5),HolidayList[Date],1,0)))),TRUE,FALSE),FALSE)","v":false},{"$f":"IFERROR(IF(AND(VLOOKUP(IT6,$NR$11:$NS$17,2,0)=\"Yes\",NOT(ISNUMBER(VLOOKUP(DATE($A$2,$A$3+$A$1-1,IT5),HolidayList[Date],1,0)))),TRUE,FALSE),FALSE)","v":false},{"$f":"IFERROR(IF(AND(VLOOKUP(IU6,$NR$11:$NS$17,2,0)=\"Yes\",NOT(ISNUMBER(VLOOKUP(DATE($A$2,$A$3+$A$1-1,IU5),HolidayList[Date],1,0)))),TRUE,FALSE),FALSE)","v":false},{"$f":"IFERROR(IF(AND(VLOOKUP(IV6,$NR$11:$NS$17,2,0)=\"Yes\",NOT(ISNUMBER(VLOOKUP(DATE($A$2,$A$3+$A$1-1,IV5),HolidayList[Date],1,0)))),TRUE,FALSE),FALSE)","v":false},{"$f":"IFERROR(IF(AND(VLOOKUP(IW6,$NR$11:$NS$17,2,0)=\"Yes\",NOT(ISNUMBER(VLOOKUP(DATE($A$2,$A$3+$A$1-1,IW5),HolidayList[Date],1,0)))),TRUE,FALSE),FALSE)","v":false},{"$f":"IFERROR(IF(AND(VLOOKUP(IX6,$NR$11:$NS$17,2,0)=\"Yes\",NOT(ISNUMBER(VLOOKUP(DATE($A$2,$A$3+$A$1-1,IX5),HolidayList[Date],1,0)))),TRUE,FALSE),FALSE)","v":false},{"$f":"IFERROR(IF(AND(VLOOKUP(IY6,$NR$11:$NS$17,2,0)=\"Yes\",NOT(ISNUMBER(VLOOKUP(DATE($A$2,$A$3+$A$1-1,IY5),HolidayList[Date],1,0)))),TRUE,FALSE),FALSE)","v":false},{"$f":"IFERROR(IF(AND(VLOOKUP(IZ6,$NR$11:$NS$17,2,0)=\"Yes\",NOT(ISNUMBER(VLOOKUP(DATE($A$2,$A$3+$A$1-1,IZ5),HolidayList[Date],1,0)))),TRUE,FALSE),FALSE)","v":false},{"$f":"IFERROR(IF(AND(VLOOKUP(JA6,$NR$11:$NS$17,2,0)=\"Yes\",NOT(ISNUMBER(VLOOKUP(DATE($A$2,$A$3+$A$1-1,JA5),HolidayList[Date],1,0)))),TRUE,FALSE),FALSE)","v":false},{"$f":"IFERROR(IF(AND(VLOOKUP(JB6,$NR$11:$NS$17,2,0)=\"Yes\",NOT(ISNUMBER(VLOOKUP(DATE($A$2,$A$3+$A$1-1,JB5),HolidayList[Date],1,0)))),TRUE,FALSE),FALSE)","v":false},{"$f":"IFERROR(IF(AND(VLOOKUP(JC6,$NR$11:$NS$17,2,0)=\"Yes\",NOT(ISNUMBER(VLOOKUP(DATE($A$2,$A$3+$A$1-1,JC5),HolidayList[Date],1,0)))),TRUE,FALSE),FALSE)","v":false},{"$f":"IFERROR(IF(AND(VLOOKUP(JD6,$NR$11:$NS$17,2,0)=\"Yes\",NOT(ISNUMBER(VLOOKUP(DATE($A$2,$A$3+$A$1-1,JD5),HolidayList[Date],1,0)))),TRUE,FALSE),FALSE)","v":false},{"$f":"IFERROR(IF(AND(VLOOKUP(JE6,$NR$11:$NS$17,2,0)=\"Yes\",NOT(ISNUMBER(VLOOKUP(DATE($A$2,$A$3+$A$1-1,JE5),HolidayList[Date],1,0)))),TRUE,FALSE),FALSE)","v":false},{"$f":"IFERROR(IF(AND(VLOOKUP(JF6,$NR$11:$NS$17,2,0)=\"Yes\",NOT(ISNUMBER(VLOOKUP(DATE($A$2,$A$3+$A$1-1,JF5),HolidayList[Date],1,0)))),TRUE,FALSE),FALSE)","v":false},{"$f":"IFERROR(IF(AND(VLOOKUP(JG6,$NR$11:$NS$17,2,0)=\"Yes\",NOT(ISNUMBER(VLOOKUP(DATE($A$2,$A$3+$A$1-1,JG5),HolidayList[Date],1,0)))),TRUE,FALSE),FALSE)","v":false},{"$f":"IFERROR(IF(AND(VLOOKUP(JH6,$NR$11:$NS$17,2,0)=\"Yes\",NOT(ISNUMBER(VLOOKUP(DATE($A$2,$A$3+$A$1-1,JH5),HolidayList[Date],1,0)))),TRUE,FALSE),FALSE)","v":false},{"$f":"IFERROR(IF(AND(VLOOKUP(JI6,$NR$11:$NS$17,2,0)=\"Yes\",NOT(ISNUMBER(VLOOKUP(DATE($A$2,$A$3+$A$1-1,JI5),HolidayList[Date],1,0)))),TRUE,FALSE),FALSE)","v":false},{"$f":"IFERROR(IF(AND(VLOOKUP(JJ6,$NR$11:$NS$17,2,0)=\"Yes\",NOT(ISNUMBER(VLOOKUP(DATE($A$2,$A$3+$A$1-1,JJ5),HolidayList[Date],1,0)))),TRUE,FALSE),FALSE)","v":false},{"$f":"IFERROR(IF(AND(VLOOKUP(JK6,$NR$11:$NS$17,2,0)=\"Yes\",NOT(ISNUMBER(VLOOKUP(DATE($A$2,$A$3+$A$1-1,JK5),HolidayList[Date],1,0)))),TRUE,FALSE),FALSE)","v":false},{"$f":"IFERROR(IF(AND(VLOOKUP(JL6,$NR$11:$NS$17,2,0)=\"Yes\",NOT(ISNUMBER(VLOOKUP(DATE($A$2,$A$3+$A$1-1,JL5),HolidayList[Date],1,0)))),TRUE,FALSE),FALSE)","v":false},{"$f":"IFERROR(IF(AND(VLOOKUP(JM6,$NR$11:$NS$17,2,0)=\"Yes\",NOT(ISNUMBER(VLOOKUP(DATE($A$2,$A$3+$A$1-1,JM5),HolidayList[Date],1,0)))),TRUE,FALSE),FALSE)","v":false},{"$f":"IFERROR(IF(AND(VLOOKUP(JN6,$NR$11:$NS$17,2,0)=\"Yes\",NOT(ISNUMBER(VLOOKUP(DATE($A$2,$A$3+$A$1-1,JN5),HolidayList[Date],1,0)))),TRUE,FALSE),FALSE)","v":false},{"$f":"IFERROR(IF(AND(VLOOKUP(JO6,$NR$11:$NS$17,2,0)=\"Yes\",NOT(ISNUMBER(VLOOKUP(DATE($A$2,$A$3+$A$1-1,JO5),HolidayList[Date],1,0)))),TRUE,FALSE),FALSE)","v":false},{"$f":"IFERROR(IF(AND(VLOOKUP(JP6,$NR$11:$NS$17,2,0)=\"Yes\",NOT(ISNUMBER(VLOOKUP(DATE($A$2,$A$3+$A$1-1,JP5),HolidayList[Date],1,0)))),TRUE,FALSE),FALSE)","v":false},{"$f":"IFERROR(IF(AND(VLOOKUP(JQ6,$NR$11:$NS$17,2,0)=\"Yes\",NOT(ISNUMBER(VLOOKUP(DATE($A$2,$A$3+$A$1-1,JQ5),HolidayList[Date],1,0)))),TRUE,FALSE),FALSE)","v":false},{"$f":"IFERROR(IF(AND(VLOOKUP(JR6,$NR$11:$NS$17,2,0)=\"Yes\",NOT(ISNUMBER(VLOOKUP(DATE($A$2,$A$3+$A$1-1,JR5),HolidayList[Date],1,0)))),TRUE,FALSE),FALSE)","v":false},{"$f":"IFERROR(IF(AND(VLOOKUP(JS6,$NR$11:$NS$17,2,0)=\"Yes\",NOT(ISNUMBER(VLOOKUP(DATE($A$2,$A$3+$A$1-1,JS5),HolidayList[Date],1,0)))),TRUE,FALSE),FALSE)","v":false},{"$f":"IFERROR(IF(AND(VLOOKUP(JT6,$NR$11:$NS$17,2,0)=\"Yes\",NOT(ISNUMBER(VLOOKUP(DATE($A$2,$A$3+$A$1-1,JT5),HolidayList[Date],1,0)))),TRUE,FALSE),FALSE)","v":false},{"$f":"IFERROR(IF(AND(VLOOKUP(JU6,$NR$11:$NS$17,2,0)=\"Yes\",NOT(ISNUMBER(VLOOKUP(DATE($A$2,$A$3+$A$1-1,JU5),HolidayList[Date],1,0)))),TRUE,FALSE),FALSE)","v":false},{"$f":"IFERROR(IF(AND(VLOOKUP(JV6,$NR$11:$NS$17,2,0)=\"Yes\",NOT(ISNUMBER(VLOOKUP(DATE($A$2,$A$3+$A$1-1,JV5),HolidayList[Date],1,0)))),TRUE,FALSE),FALSE)","v":false},{"$f":"IFERROR(IF(AND(VLOOKUP(JW6,$NR$11:$NS$17,2,0)=\"Yes\",NOT(ISNUMBER(VLOOKUP(DATE($A$2,$A$3+$A$1-1,JW5),HolidayList[Date],1,0)))),TRUE,FALSE),FALSE)","v":false},{"$f":"IFERROR(IF(AND(VLOOKUP(JX6,$NR$11:$NS$17,2,0)=\"Yes\",NOT(ISNUMBER(VLOOKUP(DATE($A$2,$A$3+$A$1-1,JX5),HolidayList[Date],1,0)))),TRUE,FALSE),FALSE)","v":false},{"$f":"IFERROR(IF(AND(VLOOKUP(JY6,$NR$11:$NS$17,2,0)=\"Yes\",NOT(ISNUMBER(VLOOKUP(DATE($A$2,$A$3+$A$1-1,JY5),HolidayList[Date],1,0)))),TRUE,FALSE),FALSE)","v":false},{"$f":"IFERROR(IF(AND(VLOOKUP(JZ6,$NR$11:$NS$17,2,0)=\"Yes\",NOT(ISNUMBER(VLOOKUP(DATE($A$2,$A$3+$A$1-1,JZ5),HolidayList[Date],1,0)))),TRUE,FALSE),FALSE)","v":false},{"$f":"IFERROR(IF(AND(VLOOKUP(KA6,$NR$11:$NS$17,2,0)=\"Yes\",NOT(ISNUMBER(VLOOKUP(DATE($A$2,$A$3+$A$1-1,KA5),HolidayList[Date],1,0)))),TRUE,FALSE),FALSE)","v":false},{"$f":"IFERROR(IF(AND(VLOOKUP(KB6,$NR$11:$NS$17,2,0)=\"Yes\",NOT(ISNUMBER(VLOOKUP(DATE($A$2,$A$3+$A$1-1,KB5),HolidayList[Date],1,0)))),TRUE,FALSE),FALSE)","v":false},{"$f":"IFERROR(IF(AND(VLOOKUP(KC6,$NR$11:$NS$17,2,0)=\"Yes\",NOT(ISNUMBER(VLOOKUP(DATE($A$2,$A$3+$A$1-1,KC5),HolidayList[Date],1,0)))),TRUE,FALSE),FALSE)","v":false},{"$f":"IFERROR(IF(AND(VLOOKUP(KD6,$NR$11:$NS$17,2,0)=\"Yes\",NOT(ISNUMBER(VLOOKUP(DATE($A$2,$A$3+$A$1-1,KD5),HolidayList[Date],1,0)))),TRUE,FALSE),FALSE)","v":false},{"$f":"IFERROR(IF(AND(VLOOKUP(KE6,$NR$11:$NS$17,2,0)=\"Yes\",NOT(ISNUMBER(VLOOKUP(DATE($A$2,$A$3+$A$1-1,KE5),HolidayList[Date],1,0)))),TRUE,FALSE),FALSE)","v":false},{"$f":"IFERROR(IF(AND(VLOOKUP(KF6,$NR$11:$NS$17,2,0)=\"Yes\",NOT(ISNUMBER(VLOOKUP(DATE($A$2,$A$3+$A$1-1,KF5),HolidayList[Date],1,0)))),TRUE,FALSE),FALSE)","v":false},{"$f":"IFERROR(IF(AND(VLOOKUP(KG6,$NR$11:$NS$17,2,0)=\"Yes\",NOT(ISNUMBER(VLOOKUP(DATE($A$2,$A$3+$A$1-1,KG5),HolidayList[Date],1,0)))),TRUE,FALSE),FALSE)","v":false},{"$f":"IFERROR(IF(AND(VLOOKUP(KH6,$NR$11:$NS$17,2,0)=\"Yes\",NOT(ISNUMBER(VLOOKUP(DATE($A$2,$A$3+$A$1-1,KH5),HolidayList[Date],1,0)))),TRUE,FALSE),FALSE)","v":false},{"$f":"IFERROR(IF(AND(VLOOKUP(KI6,$NR$11:$NS$17,2,0)=\"Yes\",NOT(ISNUMBER(VLOOKUP(DATE($A$2,$A$3+$A$1-1,KI5),HolidayList[Date],1,0)))),TRUE,FALSE),FALSE)","v":false},{"$f":"IFERROR(IF(AND(VLOOKUP(KJ6,$NR$11:$NS$17,2,0)=\"Yes\",NOT(ISNUMBER(VLOOKUP(DATE($A$2,$A$3+$A$1-1,KJ5),HolidayList[Date],1,0)))),TRUE,FALSE),FALSE)","v":false},{"$f":"IFERROR(IF(AND(VLOOKUP(KK6,$NR$11:$NS$17,2,0)=\"Yes\",NOT(ISNUMBER(VLOOKUP(DATE($A$2,$A$3+$A$1-1,KK5),HolidayList[Date],1,0)))),TRUE,FALSE),FALSE)","v":false},{"$f":"IFERROR(IF(AND(VLOOKUP(KL6,$NR$11:$NS$17,2,0)=\"Yes\",NOT(ISNUMBER(VLOOKUP(DATE($A$2,$A$3+$A$1-1,KL5),HolidayList[Date],1,0)))),TRUE,FALSE),FALSE)","v":false},{"$f":"IFERROR(IF(AND(VLOOKUP(KM6,$NR$11:$NS$17,2,0)=\"Yes\",NOT(ISNUMBER(VLOOKUP(DATE($A$2,$A$3+$A$1-1,KM5),HolidayList[Date],1,0)))),TRUE,FALSE),FALSE)","v":false},{"$f":"IFERROR(IF(AND(VLOOKUP(KN6,$NR$11:$NS$17,2,0)=\"Yes\",NOT(ISNUMBER(VLOOKUP(DATE($A$2,$A$3+$A$1-1,KN5),HolidayList[Date],1,0)))),TRUE,FALSE),FALSE)","v":false},{"$f":"IFERROR(IF(AND(VLOOKUP(KO6,$NR$11:$NS$17,2,0)=\"Yes\",NOT(ISNUMBER(VLOOKUP(DATE($A$2,$A$3+$A$1-1,KO5),HolidayList[Date],1,0)))),TRUE,FALSE),FALSE)","v":false},{"$f":"IFERROR(IF(AND(VLOOKUP(KP6,$NR$11:$NS$17,2,0)=\"Yes\",NOT(ISNUMBER(VLOOKUP(DATE($A$2,$A$3+$A$1-1,KP5),HolidayList[Date],1,0)))),TRUE,FALSE),FALSE)","v":false},{"$f":"IFERROR(IF(AND(VLOOKUP(KQ6,$NR$11:$NS$17,2,0)=\"Yes\",NOT(ISNUMBER(VLOOKUP(DATE($A$2,$A$3+$A$1-1,KQ5),HolidayList[Date],1,0)))),TRUE,FALSE),FALSE)","v":false},{"$f":"IFERROR(IF(AND(VLOOKUP(KR6,$NR$11:$NS$17,2,0)=\"Yes\",NOT(ISNUMBER(VLOOKUP(DATE($A$2,$A$3+$A$1-1,KR5),HolidayList[Date],1,0)))),TRUE,FALSE),FALSE)","v":false},{"$f":"IFERROR(IF(AND(VLOOKUP(KS6,$NR$11:$NS$17,2,0)=\"Yes\",NOT(ISNUMBER(VLOOKUP(DATE($A$2,$A$3+$A$1-1,KS5),HolidayList[Date],1,0)))),TRUE,FALSE),FALSE)","v":false},{"$f":"IFERROR(IF(AND(VLOOKUP(KT6,$NR$11:$NS$17,2,0)=\"Yes\",NOT(ISNUMBER(VLOOKUP(DATE($A$2,$A$3+$A$1-1,KT5),HolidayList[Date],1,0)))),TRUE,FALSE),FALSE)","v":false},{"$f":"IFERROR(IF(AND(VLOOKUP(KU6,$NR$11:$NS$17,2,0)=\"Yes\",NOT(ISNUMBER(VLOOKUP(DATE($A$2,$A$3+$A$1-1,KU5),HolidayList[Date],1,0)))),TRUE,FALSE),FALSE)","v":false},{"$f":"IFERROR(IF(AND(VLOOKUP(KV6,$NR$11:$NS$17,2,0)=\"Yes\",NOT(ISNUMBER(VLOOKUP(DATE($A$2,$A$3+$A$1-1,KV5),HolidayList[Date],1,0)))),TRUE,FALSE),FALSE)","v":false},{"$f":"IFERROR(IF(AND(VLOOKUP(KW6,$NR$11:$NS$17,2,0)=\"Yes\",NOT(ISNUMBER(VLOOKUP(DATE($A$2,$A$3+$A$1-1,KW5),HolidayList[Date],1,0)))),TRUE,FALSE),FALSE)","v":false},{"$f":"IFERROR(IF(AND(VLOOKUP(KX6,$NR$11:$NS$17,2,0)=\"Yes\",NOT(ISNUMBER(VLOOKUP(DATE($A$2,$A$3+$A$1-1,KX5),HolidayList[Date],1,0)))),TRUE,FALSE),FALSE)","v":false},{"$f":"IFERROR(IF(AND(VLOOKUP(KY6,$NR$11:$NS$17,2,0)=\"Yes\",NOT(ISNUMBER(VLOOKUP(DATE($A$2,$A$3+$A$1-1,KY5),HolidayList[Date],1,0)))),TRUE,FALSE),FALSE)","v":false},{"$f":"IFERROR(IF(AND(VLOOKUP(KZ6,$NR$11:$NS$17,2,0)=\"Yes\",NOT(ISNUMBER(VLOOKUP(DATE($A$2,$A$3+$A$1-1,KZ5),HolidayList[Date],1,0)))),TRUE,FALSE),FALSE)","v":false},{"$f":"IFERROR(IF(AND(VLOOKUP(LA6,$NR$11:$NS$17,2,0)=\"Yes\",NOT(ISNUMBER(VLOOKUP(DATE($A$2,$A$3+$A$1-1,LA5),HolidayList[Date],1,0)))),TRUE,FALSE),FALSE)","v":false},{"$f":"IFERROR(IF(AND(VLOOKUP(LB6,$NR$11:$NS$17,2,0)=\"Yes\",NOT(ISNUMBER(VLOOKUP(DATE($A$2,$A$3+$A$1-1,LB5),HolidayList[Date],1,0)))),TRUE,FALSE),FALSE)","v":false},{"$f":"IFERROR(IF(AND(VLOOKUP(LC6,$NR$11:$NS$17,2,0)=\"Yes\",NOT(ISNUMBER(VLOOKUP(DATE($A$2,$A$3+$A$1-1,LC5),HolidayList[Date],1,0)))),TRUE,FALSE),FALSE)","v":false},{"$f":"IFERROR(IF(AND(VLOOKUP(LD6,$NR$11:$NS$17,2,0)=\"Yes\",NOT(ISNUMBER(VLOOKUP(DATE($A$2,$A$3+$A$1-1,LD5),HolidayList[Date],1,0)))),TRUE,FALSE),FALSE)","v":false},{"$f":"IFERROR(IF(AND(VLOOKUP(LE6,$NR$11:$NS$17,2,0)=\"Yes\",NOT(ISNUMBER(VLOOKUP(DATE($A$2,$A$3+$A$1-1,LE5),HolidayList[Date],1,0)))),TRUE,FALSE),FALSE)","v":false},{"$f":"IFERROR(IF(AND(VLOOKUP(LF6,$NR$11:$NS$17,2,0)=\"Yes\",NOT(ISNUMBER(VLOOKUP(DATE($A$2,$A$3+$A$1-1,LF5),HolidayList[Date],1,0)))),TRUE,FALSE),FALSE)","v":false},{"$f":"IFERROR(IF(AND(VLOOKUP(LG6,$NR$11:$NS$17,2,0)=\"Yes\",NOT(ISNUMBER(VLOOKUP(DATE($A$2,$A$3+$A$1-1,LG5),HolidayList[Date],1,0)))),TRUE,FALSE),FALSE)","v":false},{"$f":"IFERROR(IF(AND(VLOOKUP(LH6,$NR$11:$NS$17,2,0)=\"Yes\",NOT(ISNUMBER(VLOOKUP(DATE($A$2,$A$3+$A$1-1,LH5),HolidayList[Date],1,0)))),TRUE,FALSE),FALSE)","v":false},{"$f":"IFERROR(IF(AND(VLOOKUP(LI6,$NR$11:$NS$17,2,0)=\"Yes\",NOT(ISNUMBER(VLOOKUP(DATE($A$2,$A$3+$A$1-1,LI5),HolidayList[Date],1,0)))),TRUE,FALSE),FALSE)","v":false},{"$f":"IFERROR(IF(AND(VLOOKUP(LJ6,$NR$11:$NS$17,2,0)=\"Yes\",NOT(ISNUMBER(VLOOKUP(DATE($A$2,$A$3+$A$1-1,LJ5),HolidayList[Date],1,0)))),TRUE,FALSE),FALSE)","v":false},{"$f":"IFERROR(IF(AND(VLOOKUP(LK6,$NR$11:$NS$17,2,0)=\"Yes\",NOT(ISNUMBER(VLOOKUP(DATE($A$2,$A$3+$A$1-1,LK5),HolidayList[Date],1,0)))),TRUE,FALSE),FALSE)","v":false},{"$f":"IFERROR(IF(AND(VLOOKUP(LL6,$NR$11:$NS$17,2,0)=\"Yes\",NOT(ISNUMBER(VLOOKUP(DATE($A$2,$A$3+$A$1-1,LL5),HolidayList[Date],1,0)))),TRUE,FALSE),FALSE)","v":false},{"$f":"IFERROR(IF(AND(VLOOKUP(LM6,$NR$11:$NS$17,2,0)=\"Yes\",NOT(ISNUMBER(VLOOKUP(DATE($A$2,$A$3+$A$1-1,LM5),HolidayList[Date],1,0)))),TRUE,FALSE),FALSE)","v":false},{"$f":"IFERROR(IF(AND(VLOOKUP(LN6,$NR$11:$NS$17,2,0)=\"Yes\",NOT(ISNUMBER(VLOOKUP(DATE($A$2,$A$3+$A$1-1,LN5),HolidayList[Date],1,0)))),TRUE,FALSE),FALSE)","v":false},{"$f":"IFERROR(IF(AND(VLOOKUP(LO6,$NR$11:$NS$17,2,0)=\"Yes\",NOT(ISNUMBER(VLOOKUP(DATE($A$2,$A$3+$A$1-1,LO5),HolidayList[Date],1,0)))),TRUE,FALSE),FALSE)","v":false},{"$f":"IFERROR(IF(AND(VLOOKUP(LP6,$NR$11:$NS$17,2,0)=\"Yes\",NOT(ISNUMBER(VLOOKUP(DATE($A$2,$A$3+$A$1-1,LP5),HolidayList[Date],1,0)))),TRUE,FALSE),FALSE)","v":false},{"$f":"IFERROR(IF(AND(VLOOKUP(LQ6,$NR$11:$NS$17,2,0)=\"Yes\",NOT(ISNUMBER(VLOOKUP(DATE($A$2,$A$3+$A$1-1,LQ5),HolidayList[Date],1,0)))),TRUE,FALSE),FALSE)","v":false},{"$f":"IFERROR(IF(AND(VLOOKUP(LR6,$NR$11:$NS$17,2,0)=\"Yes\",NOT(ISNUMBER(VLOOKUP(DATE($A$2,$A$3+$A$1-1,LR5),HolidayList[Date],1,0)))),TRUE,FALSE),FALSE)","v":false},{"$f":"IFERROR(IF(AND(VLOOKUP(LS6,$NR$11:$NS$17,2,0)=\"Yes\",NOT(ISNUMBER(VLOOKUP(DATE($A$2,$A$3+$A$1-1,LS5),HolidayList[Date],1,0)))),TRUE,FALSE),FALSE)","v":false},{"$f":"IFERROR(IF(AND(VLOOKUP(LT6,$NR$11:$NS$17,2,0)=\"Yes\",NOT(ISNUMBER(VLOOKUP(DATE($A$2,$A$3+$A$1-1,LT5),HolidayList[Date],1,0)))),TRUE,FALSE),FALSE)","v":false},{"$f":"IFERROR(IF(AND(VLOOKUP(LU6,$NR$11:$NS$17,2,0)=\"Yes\",NOT(ISNUMBER(VLOOKUP(DATE($A$2,$A$3+$A$1-1,LU5),HolidayList[Date],1,0)))),TRUE,FALSE),FALSE)","v":false},{"$f":"IFERROR(IF(AND(VLOOKUP(LV6,$NR$11:$NS$17,2,0)=\"Yes\",NOT(ISNUMBER(VLOOKUP(DATE($A$2,$A$3+$A$1-1,LV5),HolidayList[Date],1,0)))),TRUE,FALSE),FALSE)","v":false},{"$f":"IFERROR(IF(AND(VLOOKUP(LW6,$NR$11:$NS$17,2,0)=\"Yes\",NOT(ISNUMBER(VLOOKUP(DATE($A$2,$A$3+$A$1-1,LW5),HolidayList[Date],1,0)))),TRUE,FALSE),FALSE)","v":false},{"$f":"IFERROR(IF(AND(VLOOKUP(LX6,$NR$11:$NS$17,2,0)=\"Yes\",NOT(ISNUMBER(VLOOKUP(DATE($A$2,$A$3+$A$1-1,LX5),HolidayList[Date],1,0)))),TRUE,FALSE),FALSE)","v":false},{"$f":"IFERROR(IF(AND(VLOOKUP(LY6,$NR$11:$NS$17,2,0)=\"Yes\",NOT(ISNUMBER(VLOOKUP(DATE($A$2,$A$3+$A$1-1,LY5),HolidayList[Date],1,0)))),TRUE,FALSE),FALSE)","v":false},{"$f":"IFERROR(IF(AND(VLOOKUP(LZ6,$NR$11:$NS$17,2,0)=\"Yes\",NOT(ISNUMBER(VLOOKUP(DATE($A$2,$A$3+$A$1-1,LZ5),HolidayList[Date],1,0)))),TRUE,FALSE),FALSE)","v":false},{"$f":"IFERROR(IF(AND(VLOOKUP(MA6,$NR$11:$NS$17,2,0)=\"Yes\",NOT(ISNUMBER(VLOOKUP(DATE($A$2,$A$3+$A$1-1,MA5),HolidayList[Date],1,0)))),TRUE,FALSE),FALSE)","v":false},{"$f":"IFERROR(IF(AND(VLOOKUP(MB6,$NR$11:$NS$17,2,0)=\"Yes\",NOT(ISNUMBER(VLOOKUP(DATE($A$2,$A$3+$A$1-1,MB5),HolidayList[Date],1,0)))),TRUE,FALSE),FALSE)","v":false},{"$f":"IFERROR(IF(AND(VLOOKUP(MC6,$NR$11:$NS$17,2,0)=\"Yes\",NOT(ISNUMBER(VLOOKUP(DATE($A$2,$A$3+$A$1-1,MC5),HolidayList[Date],1,0)))),TRUE,FALSE),FALSE)","v":false},{"$f":"IFERROR(IF(AND(VLOOKUP(MD6,$NR$11:$NS$17,2,0)=\"Yes\",NOT(ISNUMBER(VLOOKUP(DATE($A$2,$A$3+$A$1-1,MD5),HolidayList[Date],1,0)))),TRUE,FALSE),FALSE)","v":false},{"$f":"IFERROR(IF(AND(VLOOKUP(ME6,$NR$11:$NS$17,2,0)=\"Yes\",NOT(ISNUMBER(VLOOKUP(DATE($A$2,$A$3+$A$1-1,ME5),HolidayList[Date],1,0)))),TRUE,FALSE),FALSE)","v":false},{"$f":"IFERROR(IF(AND(VLOOKUP(MF6,$NR$11:$NS$17,2,0)=\"Yes\",NOT(ISNUMBER(VLOOKUP(DATE($A$2,$A$3+$A$1-1,MF5),HolidayList[Date],1,0)))),TRUE,FALSE),FALSE)","v":false},{"$f":"IFERROR(IF(AND(VLOOKUP(MG6,$NR$11:$NS$17,2,0)=\"Yes\",NOT(ISNUMBER(VLOOKUP(DATE($A$2,$A$3+$A$1-1,MG5),HolidayList[Date],1,0)))),TRUE,FALSE),FALSE)","v":false},{"$f":"IFERROR(IF(AND(VLOOKUP(MH6,$NR$11:$NS$17,2,0)=\"Yes\",NOT(ISNUMBER(VLOOKUP(DATE($A$2,$A$3+$A$1-1,MH5),HolidayList[Date],1,0)))),TRUE,FALSE),FALSE)","v":false},{"$f":"IFERROR(IF(AND(VLOOKUP(MI6,$NR$11:$NS$17,2,0)=\"Yes\",NOT(ISNUMBER(VLOOKUP(DATE($A$2,$A$3+$A$1-1,MI5),HolidayList[Date],1,0)))),TRUE,FALSE),FALSE)","v":false},{"$f":"IFERROR(IF(AND(VLOOKUP(MJ6,$NR$11:$NS$17,2,0)=\"Yes\",NOT(ISNUMBER(VLOOKUP(DATE($A$2,$A$3+$A$1-1,MJ5),HolidayList[Date],1,0)))),TRUE,FALSE),FALSE)","v":false},{"$f":"IFERROR(IF(AND(VLOOKUP(MK6,$NR$11:$NS$17,2,0)=\"Yes\",NOT(ISNUMBER(VLOOKUP(DATE($A$2,$A$3+$A$1-1,MK5),HolidayList[Date],1,0)))),TRUE,FALSE),FALSE)","v":false},{"$f":"IFERROR(IF(AND(VLOOKUP(ML6,$NR$11:$NS$17,2,0)=\"Yes\",NOT(ISNUMBER(VLOOKUP(DATE($A$2,$A$3+$A$1-1,ML5),HolidayList[Date],1,0)))),TRUE,FALSE),FALSE)","v":false},{"$f":"IFERROR(IF(AND(VLOOKUP(MM6,$NR$11:$NS$17,2,0)=\"Yes\",NOT(ISNUMBER(VLOOKUP(DATE($A$2,$A$3+$A$1-1,MM5),HolidayList[Date],1,0)))),TRUE,FALSE),FALSE)","v":false},{"$f":"IFERROR(IF(AND(VLOOKUP(MN6,$NR$11:$NS$17,2,0)=\"Yes\",NOT(ISNUMBER(VLOOKUP(DATE($A$2,$A$3+$A$1-1,MN5),HolidayList[Date],1,0)))),TRUE,FALSE),FALSE)","v":false},{"$f":"IFERROR(IF(AND(VLOOKUP(MO6,$NR$11:$NS$17,2,0)=\"Yes\",NOT(ISNUMBER(VLOOKUP(DATE($A$2,$A$3+$A$1-1,MO5),HolidayList[Date],1,0)))),TRUE,FALSE),FALSE)","v":false},{"$f":"IFERROR(IF(AND(VLOOKUP(MP6,$NR$11:$NS$17,2,0)=\"Yes\",NOT(ISNUMBER(VLOOKUP(DATE($A$2,$A$3+$A$1-1,MP5),HolidayList[Date],1,0)))),TRUE,FALSE),FALSE)","v":false},{"$f":"IFERROR(IF(AND(VLOOKUP(MQ6,$NR$11:$NS$17,2,0)=\"Yes\",NOT(ISNUMBER(VLOOKUP(DATE($A$2,$A$3+$A$1-1,MQ5),HolidayList[Date],1,0)))),TRUE,FALSE),FALSE)","v":false},{"$f":"IFERROR(IF(AND(VLOOKUP(MR6,$NR$11:$NS$17,2,0)=\"Yes\",NOT(ISNUMBER(VLOOKUP(DATE($A$2,$A$3+$A$1-1,MR5),HolidayList[Date],1,0)))),TRUE,FALSE),FALSE)","v":false},{"$f":"IFERROR(IF(AND(VLOOKUP(MS6,$NR$11:$NS$17,2,0)=\"Yes\",NOT(ISNUMBER(VLOOKUP(DATE($A$2,$A$3+$A$1-1,MS5),HolidayList[Date],1,0)))),TRUE,FALSE),FALSE)","v":false},{"$f":"IFERROR(IF(AND(VLOOKUP(MT6,$NR$11:$NS$17,2,0)=\"Yes\",NOT(ISNUMBER(VLOOKUP(DATE($A$2,$A$3+$A$1-1,MT5),HolidayList[Date],1,0)))),TRUE,FALSE),FALSE)","v":false},{"$f":"IFERROR(IF(AND(VLOOKUP(MU6,$NR$11:$NS$17,2,0)=\"Yes\",NOT(ISNUMBER(VLOOKUP(DATE($A$2,$A$3+$A$1-1,MU5),HolidayList[Date],1,0)))),TRUE,FALSE),FALSE)","v":false},{"$f":"IFERROR(IF(AND(VLOOKUP(MV6,$NR$11:$NS$17,2,0)=\"Yes\",NOT(ISNUMBER(VLOOKUP(DATE($A$2,$A$3+$A$1-1,MV5),HolidayList[Date],1,0)))),TRUE,FALSE),FALSE)","v":false},{"$f":"IFERROR(IF(AND(VLOOKUP(MW6,$NR$11:$NS$17,2,0)=\"Yes\",NOT(ISNUMBER(VLOOKUP(DATE($A$2,$A$3+$A$1-1,MW5),HolidayList[Date],1,0)))),TRUE,FALSE),FALSE)","v":false},{"$f":"IFERROR(IF(AND(VLOOKUP(MX6,$NR$11:$NS$17,2,0)=\"Yes\",NOT(ISNUMBER(VLOOKUP(DATE($A$2,$A$3+$A$1-1,MX5),HolidayList[Date],1,0)))),TRUE,FALSE),FALSE)","v":false},{"$f":"IFERROR(IF(AND(VLOOKUP(MY6,$NR$11:$NS$17,2,0)=\"Yes\",NOT(ISNUMBER(VLOOKUP(DATE($A$2,$A$3+$A$1-1,MY5),HolidayList[Date],1,0)))),TRUE,FALSE),FALSE)","v":false},{"$f":"IFERROR(IF(AND(VLOOKUP(MZ6,$NR$11:$NS$17,2,0)=\"Yes\",NOT(ISNUMBER(VLOOKUP(DATE($A$2,$A$3+$A$1-1,MZ5),HolidayList[Date],1,0)))),TRUE,FALSE),FALSE)","v":false},{"$f":"IFERROR(IF(AND(VLOOKUP(NA6,$NR$11:$NS$17,2,0)=\"Yes\",NOT(ISNUMBER(VLOOKUP(DATE($A$2,$A$3+$A$1-1,NA5),HolidayList[Date],1,0)))),TRUE,FALSE),FALSE)","v":false},{"$f":"IFERROR(IF(AND(VLOOKUP(NB6,$NR$11:$NS$17,2,0)=\"Yes\",NOT(ISNUMBER(VLOOKUP(DATE($A$2,$A$3+$A$1-1,NB5),HolidayList[Date],1,0)))),TRUE,FALSE),FALSE)","v":false},{"$f":"IFERROR(IF(AND(VLOOKUP(NC6,$NR$11:$NS$17,2,0)=\"Yes\",NOT(ISNUMBER(VLOOKUP(DATE($A$2,$A$3+$A$1-1,NC5),HolidayList[Date],1,0)))),TRUE,FALSE),FALSE)","v":false},{"$f":"IFERROR(IF(AND(VLOOKUP(ND6,$NR$11:$NS$17,2,0)=\"Yes\",NOT(ISNUMBER(VLOOKUP(DATE($A$2,$A$3+$A$1-1,ND5),HolidayList[Date],1,0)))),TRUE,FALSE),FALSE)","v":false},{"$f":"IFERROR(IF(AND(VLOOKUP(NE6,$NR$11:$NS$17,2,0)=\"Yes\",NOT(ISNUMBER(VLOOKUP(DATE($A$2,$A$3+$A$1-1,NE5),HolidayList[Date],1,0)))),TRUE,FALSE),FALSE)","v":false},{"$f":"IFERROR(IF(AND(VLOOKUP(NF6,$NR$11:$NS$17,2,0)=\"Yes\",NOT(ISNUMBER(VLOOKUP(DATE($A$2,$A$3+$A$1-1,NF5),HolidayList[Date],1,0)))),TRUE,FALSE),FALSE)","v":false},{"$f":"IFERROR(IF(AND(VLOOKUP(NG6,$NR$11:$NS$17,2,0)=\"Yes\",NOT(ISNUMBER(VLOOKUP(DATE($A$2,$A$3+$A$1-1,NG5),HolidayList[Date],1,0)))),TRUE,FALSE),FALSE)","v":false},{"$f":"IFERROR(IF(AND(VLOOKUP(NH6,$NR$11:$NS$17,2,0)=\"Yes\",NOT(ISNUMBER(VLOOKUP(DATE($A$2,$A$3+$A$1-1,NH5),HolidayList[Date],1,0)))),TRUE,FALSE),FALSE)","v":false},{"$f":"IFERROR(IF(AND(VLOOKUP(NI6,$NR$11:$NS$17,2,0)=\"Yes\",NOT(ISNUMBER(VLOOKUP(DATE($A$2,$A$3+$A$1-1,NI5),HolidayList[Date],1,0)))),TRUE,FALSE),FALSE)","v":false},null,null,"Leave Breakup",{"$nulls":5},"Maternity Leave ","M"]
[null,{"$f":"IF(AND((COLUMN()-1)>31*($A$3-1),MONTH(DATE($A$2+INT(($A$3+$A$1)/12),INT((COLUMN()-1)/31.001)+$A$1,ROUNDUP(MOD(COLUMN()-1,31.001),0)))=ROUNDUP(MOD($A$1+$A$3-1,12.01),0)),ROUNDUP(MOD(COLUMN()-1,31.001),0),\"\")","v":"1900-01-01"},{"$f":"IF(AND((COLUMN()-1)>31*($A$3-1),MONTH(DATE($A$2+INT(($A$3+$A$1)/12),INT((COLUMN()-1)/31.001)+$A$1,ROUNDUP(MOD(COLUMN()-1,31.001),0)))=ROUNDUP(MOD($A$1+$A$3-1,12.01),0)),ROUNDUP(MOD(COLUMN()-1,31.001),0),\"\")","v":"1900-01-02"},"1900-01-03","1900-01-04","1900-01-05","1900-01-06","1900-01-07","1900-01-08","1900-01-09","1900-01-10","1900-01-11","1900-01-12","1900-01-13","1900-01-14","1900-01-15","1900-01-16","1900-01-17","1900-01-18","1900-01-19","1900-01-20","1900-01-21","1900-01-22","1900-01-23","1900-01-24","1900-01-25","1900-01-26","1900-01-27","1900-01-28","1900-01-29","1900-01-30","1900-01-31","","","","","","","","","","","","","","","","","","","","","","","","","","","","","","","","","","",{"$f":"IF(AND((COLUMN()-1)>31*($A$3-1),MONTH(DATE($A$2+INT(($A$3+$A$1)/12),INT((COLUMN()-1)/31.001)+$A$1,ROUNDUP(MOD(COLUMN()-1,31.001),0)))=ROUNDUP(MOD($A$1+$A$3-1,12.01),0)),ROUNDUP(MOD(COLUMN()-1,31.001),0),\"\")","v":""},"","","","","","","","","","","","","","","","","","","","","","","","","","","","","","","","","","","","","","","","","","","","","","","","","","","","","","","","","","","","","","","",{"$f":"IF(AND((COLUMN()-1)>31*($A$3-1),MONTH(DATE($A$2+INT(($A$3+$A$1)/12),INT((COLUMN()-1)/31.001)+$A$1,ROUNDUP(MOD(COLUMN()-1,31.001),0)))=ROUNDUP(MOD($A$1+$A$3-1,12.01),0)),ROUNDUP(MOD(COLUMN()-1,31.001),0),\"\")","v":""},"","","","","","","","","","","","","","","","","","","","","","","","","","","","","","","","","","","","","","","","","","","","","","","","","","","","","","","","","","","","","","","",{"$f":"IF(AND((COLUMN()-1)>31*($A$3-1),MONTH(DATE($A$2+INT(($A$3+$A$1)/12),INT((COLUMN()-1)/31.001)+$A$1,ROUNDUP(MOD(COLUMN()-1,31.001),0)))=ROUNDUP(MOD($A$1+$A$3-1,12.01),0)),ROUNDUP(MOD(COLUMN()-1,31.001),0),\"\")","v":""},"","","","","","","","","","","","","","","","","","","","","","","","","","","","","","","","","","","","","","","","","","","","","","","","","","","","","","","","","","","","","","","",{"$f":"IF(AND((COLUMN()-1)>31*($A$3-1),MONTH(DATE($A$2+INT(($A$3+$A$1)/12),INT((COLUMN()-1)/31.001)+$A$1,ROUNDUP(MOD(COLUMN()-1,31.001),0)))=ROUNDUP(MOD($A$1+$A$3-1,12.01),0)),ROUNDUP(MOD(COLUMN()-1,31.001),0),\"\")","v":""},"","","","","","","","","","","","","","","","","","","","","","","","","","","","","","","","","","","","","","","","","","","","","","","","","","","","","","","","","","","","","","","",{"$f":"IF(AND((COLUMN()-1)>31*($A$3-1),MONTH(DATE($A$2+INT(($A$3+$A$1)/12),INT((COLUMN()-1)/31.001)+$A$1,ROUNDUP(MOD(COLUMN()-1,31.001),0)))=ROUNDUP(MOD($A$1+$A$3-1,12.01),0)),ROUNDUP(MOD(COLUMN()-1,31.001),0),\"\")","v":""},"","","","","","","","","","","","","","","","","","","","","","","","","","","","","","","","","","","","","","","","","","","","","","","","","","","Leaves This Month","Leaves This Year","S","V","M","C","H",null,"Casual Leave","C"]
["Name",{"$f":"IF(B$5=\"\",\"\",VLOOKUP(WEEKDAY(DATE($A$2,$A$3+$A$1-1,B5),2),Sheet3!$D$1:$E$7,2,0))","v":"Sun"},{"$f":"IF(C$5=\"\",\"\",VLOOKUP(WEEKDAY(DATE($A$2,$A$3+$A$1-1,C5),2),Sheet3!$D$1:$E$7,2,0))","v":"Mon"},{"$f":"IF(D$5=\"\",\"\",VLOOKUP(WEEKDAY(DATE($A$2,$A$3+$A$1-1,D5),2),Sheet3!$D$1:$E$7,2,0))","v":"Tue"},{"$f":"IF(E$5=\"\",\"\",VLOOKUP(WEEKDAY(DATE($A$2,$A$3+$A$1-1,E5),2),Sheet3!$D$1:$E$7,2,0))","v":"Wed"},{"$f":"IF(F$5=\"\",\"\",VLOOKUP(WEEKDAY(DATE($A$2,$A$3+$A$1-1,F5),2),Sheet3!$D$1:$E$7,2,0))","v":"Thu"},{"$f":"IF(G$5=\"\",\"\",VLOOKUP(WEEKDAY(DATE($A$2,$A$3+$A$1-1,G5),2),Sheet3!$D$1:$E$7,2,0))","v":"Fri"},{"$f":"IF(H$5=\"\",\"\",VLOOKUP(WEEKDAY(DATE($A$2,$A$3+$A$1-1,H5),2),Sheet3!$D$1:$E$7,2,0))","v":"Sat"},{"$f":"IF(I$5=\"\",\"\",VLOOKUP(WEEKDAY(DATE($A$2,$A$3+$A$1-1,I5),2),Sheet3!$D$1:$E$7,2,0))","v":"Sun"},{"$f":"IF(J$5=\"\",\"\",VLOOKUP(WEEKDAY(DATE($A$2,$A$3+$A$1-1,J5),2),Sheet3!$D$1:$E$7,2,0))","v":"Mon"},{"$f":"IF(K$5=\"\",\"\",VLOOKUP(WEEKDAY(DATE($A$2,$A$3+$A$1-1,K5),2),Sheet3!$D$1:$E$7,2,0))","v":"Tue"},{"$f":"IF(L$5=\"\",\"\",VLOOKUP(WEEKDAY(DATE($A$2,$A$3+$A$1-1,L5),2),Sheet3!$D$1:$E$7,2,0))","v":"Wed"},{"$f":"IF(M$5=\"\",\"\",VLOOKUP(WEEKDAY(DATE($A$2,$A$3+$A$1-1,M5),2),Sheet3!$D$1:$E$7,2,0))","v":"Thu"},{"$f":"IF(N$5=\"\",\"\",VLOOKUP(WEEKDAY(DATE($A$2,$A$3+$A$1-1,N5),2),Sheet3!$D$1:$E$7,2,0))","v":"Fri"},{"$f":"IF(O$5=\"\",\"\",VLOOKUP(WEEKDAY(DATE($A$2,$A$3+$A$1-1,O5),2),Sheet3!$D$1:$E$7,2,0))","v":"Sat"},{"$f":"IF(P$5=\"\",\"\",VLOOKUP(WEEKDAY(DATE($A$2,$A$3+$A$1-1,P5),2),Sheet3!$D$1:$E$7,2,0))","v":"Sun"},{"$f":"IF(Q$5=\"\",\"\",VLOOKUP(WEEKDAY(DATE($A$2,$A$3+$A$1-1,Q5),2),Sheet3!$D$1:$E$7,2,0))","v":"Mon"},{"$f":"IF(R$5=\"\",\"\",VLOOKUP(WEEKDAY(DATE($A$2,$A$3+$A$1-1,R5),2),Sheet3!$D$1:$E$7,2,0))","v":"Tue"},{"$f":"IF(S$5=\"\",\"\",VLOOKUP(WEEKDAY(DATE($A$2,$A$3+$A$1-1,S5),2),Sheet3!$D$1:$E$7,2,0))","v":"Wed"},{"$f":"IF(T$5=\"\",\"\",VLOOKUP(WEEKDAY(DATE($A$2,$A$3+$A$1-1,T5),2),Sheet3!$D$1:$E$7,2,0))","v":"Thu"},{"$f":"IF(U$5=\"\",\"\",VLOOKUP(WEEKDAY(DATE($A$2,$A$3+$A$1-1,U5),2),Sheet3!$D$1:$E$7,2,0))","v":"Fri"},{"$f":"IF(V$5=\"\",\"\",VLOOKUP(WEEKDAY(DATE($A$2,$A$3+$A$1-1,V5),2),Sheet3!$D$1:$E$7,2,0))","v":"Sat"},{"$f":"IF(W$5=\"\",\"\",VLOOKUP(WEEKDAY(DATE($A$2,$A$3+$A$1-1,W5),2),Sheet3!$D$1:$E$7,2,0))","v":"Sun"},{"$f":"IF(X$5=\"\",\"\",VLOOKUP(WEEKDAY(DATE($A$2,$A$3+$A$1-1,X5),2),Sheet3!$D$1:$E$7,2,0))","v":"Mon"},{"$f":"IF(Y$5=\"\",\"\",VLOOKUP(WEEKDAY(DATE($A$2,$A$3+$A$1-1,Y5),2),Sheet3!$D$1:$E$7,2,0))","v":"Tue"},{"$f":"IF(Z$5=\"\",\"\",VLOOKUP(WEEKDAY(DATE($A$2,$A$3+$A$1-1,Z5),2),Sheet3!$D$1:$E$7,2,0))","v":"Wed"},{"$f":"IF(AA$5=\"\",\"\",VLOOKUP(WEEKDAY(DATE($A$2,$A$3+$A$1-1,AA5),2),Sheet3!$D$1:$E$7,2,0))","v":"Thu"},{"$f":"IF(AB$5=\"\",\"\",VLOOKUP(WEEKDAY(DATE($A$2,$A$3+$A$1-1,AB5),2),Sheet3!$D$1:$E$7,2,0))","v":"Fri"},{"$f":"IF(AC$5=\"\",\"\",VLOOKUP(WEEKDAY(DATE($A$2,$A$3+$A$1-1,AC5),2),Sheet3!$D$1:$E$7,2,0))","v":"Sat"},{"$f":"IF(AD$5=\"\",\"\",VLOOKUP(WEEKDAY(DATE($A$2,$A$3+$A$1-1,AD5),2),Sheet3!$D$1:$E$7,2,0))","v":"Sun"},{"$f":"IF(AE$5=\"\",\"\",VLOOKUP(WEEKDAY(DATE($A$2,$A$3+$A$1-1,AE5),2),Sheet3!$D$1:$E$7,2,0))","v":"Mon"},{"$f":"IF(AF$5=\"\",\"\",VLOOKUP(WEEKDAY(DATE($A$2,$A$3+$A$1-1,AF5),2),Sheet3!$D$1:$E$7,2,0))","v":"Tue"},{"$f":"IF(AG$5=\"\",\"\",VLOOKUP(WEEKDAY(DATE($A$2,$A$3+$A$1-1,AG5),2),Sheet3!$D$1:$E$7,2,0))","v":""},{"$f":"IF(AH$5=\"\",\"\",VLOOKUP(WEEKDAY(DATE($A$2,$A$3+$A$1-1,AH5),2),Sheet3!$D$1:$E$7,2,0))","v":""},{"$f":"IF(AI$5=\"\",\"\",VLOOKUP(WEEKDAY(DATE($A$2,$A$3+$A$1-1,AI5),2),Sheet3!$D$1:$E$7,2,0))","v":""},{"$f":"IF(AJ$5=\"\",\"\",VLOOKUP(WEEKDAY(DATE($A$2,$A$3+$A$1-1,AJ5),2),Sheet3!$D$1:$E$7,2,0))","v":""},{"$f":"IF(AK$5=\"\",\"\",VLOOKUP(WEEKDAY(DATE($A$2,$A$3+$A$1-1,AK5),2),Sheet3!$D$1:$E$7,2,0))","v":""},{"$f":"IF(AL$5=\"\",\"\",VLOOKUP(WEEKDAY(DATE($A$2,$A$3+$A$1-1,AL5),2),Sheet3!$D$1:$E$7,2,0))","v":""},{"$f":"IF(AM$5=\"\",\"\",VLOOKUP(WEEKDAY(DATE($A$2,$A$3+$A$1-1,AM5),2),Sheet3!$D$1:$E$7,2,0))","v":""},{"$f":"IF(AN$5=\"\",\"\",VLOOKUP(WEEKDAY(DATE($A$2,$A$3+$A$1-1,AN5),2),Sheet3!$D$1:$E$7,2,0))","v":""},{"$f":"IF(AO$5=\"\",\"\",VLOOKUP(WEEKDAY(DATE($A$2,$A$3+$A$1-1,AO5),2),Sheet3!$D$1:$E$7,2,0))","v":""},{"$f":"IF(AP$5=\"\",\"\",VLOOKUP(WEEKDAY(DATE($A$2,$A$3+$A$1-1,AP5),2),Sheet3!$D$1:$E$7,2,0))","v":""},{"$f":"IF(AQ$5=\"\",\"\",VLOOKUP(WEEKDAY(DATE($A$2,$A$3+$A$1-1,AQ5),2),Sheet3!$D$1:$E$7,2,0))","v":""},{"$f":"IF(AR$5=\"\",\"\",VLOOKUP(WEEKDAY(DATE($A$2,$A$3+$A$1-1,AR5),2),Sheet3!$D$1:$E$7,2,0))","v":""},{"$f":"IF(AS$5=\"\",\"\",VLOOKUP(WEEKDAY(DATE($A$2,$A$3+$A$1-1,AS5),2),Sheet3!$D$1:$E$7,2,0))","v":""},{"$f":"IF(AT$5=\"\",\"\",VLOOKUP(WEEKDAY(DATE($A$2,$A$3+$A$1-1,AT5),2),Sheet3!$D$1:$E$7,2,0))","v":""},{"$f":"IF(AU$5=\"\",\"\",VLOOKUP(WEEKDAY(DATE($A$2,$A$3+$A$1-1,AU5),2),Sheet3!$D$1:$E$7,2,0))","v":""},{"$f":"IF(AV$5=\"\",\"\",VLOOKUP(WEEKDAY(DATE($A$2,$A$3+$A$1-1,AV5),2),Sheet3!$D$1:$E$7,2,0))","v":""},{"$f":"IF(AW$5=\"\",\"\",VLOOKUP(WEEKDAY(DATE($A$2,$A$3+$A$1-1,AW5),2),Sheet3!$D$1:$E$7,2,0))","v":""},{"$f":"IF(AX$5=\"\",\"\",VLOOKUP(WEEKDAY(DATE($A$2,$A$3+$A$1-1,AX5),2),Sheet3!$D$1:$E$7,2,0))","v":""},{"$f":"IF(AY$5=\"\",\"\",VLOOKUP(WEEKDAY(DATE($A$2,$A$3+$A$1-1,AY5),2),Sheet3!$D$1:$E$7,2,0))","v":""},{"$f":"IF(AZ$5=\"\",\"\",VLOOKUP(WEEKDAY(DATE($A$2,$A$3+$A$1-1,AZ5),2),Sheet3!$D$1:$E$7,2,0))","v":""},{"$f":"IF(BA$5=\"\",\"\",VLOOKUP(WEEKDAY(DATE($A$2,$A$3+$A$1-1,BA5),2),Sheet3!$D$1:$E$7,2,0))","v":""},{"$f":"IF(BB$5=\"\",\"\",VLOOKUP(WEEKDAY(DATE($A$2,$A$3+$A$1-1,BB5),2),Sheet3!$D$1:$E$7,2,0))","v":""},{"$f":"IF(BC$5=\"\",\"\",VLOOKUP(WEEKDAY(DATE($A$2,$A$3+$A$1-1,BC5),2),Sheet3!$D$1:$E$7,2,0))","v":""},{"$f":"IF(BD$5=\"\",\"\",VLOOKUP(WEEKDAY(DATE($A$2,$A$3+$A$1-1,BD5),2),Sheet3!$D$1:$E$7,2,0))","v":""},{"$f":"IF(BE$5=\"\",\"\",VLOOKUP(WEEKDAY(DATE($A$2,$A$3+$A$1-1,BE5),2),Sheet3!$D$1:$E$7,2,0))","v":""},{"$f":"IF(BF$5=\"\",\"\",VLOOKUP(WEEKDAY(DATE($A$2,$A$3+$A$1-1,BF5),2),Sheet3!$D$1:$E$7,2,0))","v":""},{"$f":"IF(BG$5=\"\",\"\",VLOOKUP(WEEKDAY(DATE($A$2,$A$3+$A$1-1,BG5),2),Sheet3!$D$1:$E$7,2,0))","v":""},{"$f":"IF(BH$5=\"\",\"\",VLOOKUP(WEEKDAY(DATE($A$2,$A$3+$A$1-1,BH5),2),Sheet3!$D$1:$E$7,2,0))","v":""},{"$f":"IF(BI$5=\"\",\"\",VLOOKUP(WEEKDAY(DATE($A$2,$A$3+$A$1-1,BI5),2),Sheet3!$D$1:$E$7,2,0))","v":""},{"$f":"IF(BJ$5=\"\",\"\",VLOOKUP(WEEKDAY(DATE($A$2,$A$3+$A$1-1,BJ5),2),Sheet3!$D$1:$E$7,2,0))","v":""},{"$f":"IF(BK$5=\"\",\"\",VLOOKUP(WEEKDAY(DATE($A$2,$A$3+$A$1-1,BK5),2),Sheet3!$D$1:$E$7,2,0))","v":""},{"$f":"IF(BL$5=\"\",\"\",VLOOKUP(WEEKDAY(DATE($A$2,$A$3+$A$1-1,BL5),2),Sheet3!$D$1:$E$7,2,0))","v":""},{"$f":"IF(BM$5=\"\",\"\",VLOOKUP(WEEKDAY(DATE($A$2,$A$3+$A$1-1,BM5),2),Sheet3!$D$1:$E$7,2,0))","v":""},{"$f":"IF(BN$5=\"\",\"\",VLOOKUP(WEEKDAY(DATE($A$2,$A$3+$A$1-1,BN5),2),Sheet3!$D$1:$E$7,2,0))","v":""},{"$f":"IF(BO$5=\"\",\"\",VLOOKUP(WEEKDAY(DATE($A$2,$A$3+$A$1-1,BO5),2),Sheet3!$D$1:$E$7,2,0))","v":""},{"$f":"IF(BP$5=\"\",\"\",VLOOKUP(WEEKDAY(DATE($A$2,$A$3+$A$1-1,BP5),2),Sheet3!$D$1:$E$7,2,0))","v":""},{"$f":"IF(BQ$5=\"\",\"\",VLOOKUP(WEEKDAY(DATE($A$2,$A$3+$A$1-1,BQ5),2),Sheet3!$D$1:$E$7,2,0))","v":""},{"$f":"IF(BR$5=\"\",\"\",VLOOKUP(WEEKDAY(DATE($A$2,$A$3+$A$1-1,BR5),2),Sheet3!$D$1:$E$7,2,0))","v":""},{"$f":"IF(BS$5=\"\",\"\",VLOOKUP(WEEKDAY(DATE($A$2,$A$3+$A$1-1,BS5),2),Sheet3!$D$1:$E$7,2,0))","v":""},{"$f":"IF(BT$5=\"\",\"\",VLOOKUP(WEEKDAY(DATE($A$2,$A$3+$A$1-1,BT5),2),Sheet3!$D$1:$E$7,2,0))","v":""},{"$f":"IF(BU$5=\"\",\"\",VLOOKUP(WEEKDAY(DATE($A$2,$A$3+$A$1-1,BU5),2),Sheet3!$D$1:$E$7,2,0))","v":""},{"$f":"IF(BV$5=\"\",\"\",VLOOKUP(WEEKDAY(DATE($A$2,$A$3+$A$1-1,BV5),2),Sheet3!$D$1:$E$7,2,0))","v":""},{"$f":"IF(BW$5=\"\",\"\",VLOOKUP(WEEKDAY(DATE($A$2,$A$3+$A$1-1,BW5),2),Sheet3!$D$1:$E$7,2,0))","v":""},{"$f":"IF(BX$5=\"\",\"\",VLOOKUP(WEEKDAY(DATE($A$2,$A$3+$A$1-1,BX5),2),Sheet3!$D$1:$E$7,2,0))","v":""},{"$f":"IF(BY$5=\"\",\"\",VLOOKUP(WEEKDAY(DATE($A$2,$A$3+$A$1-1,BY5),2),Sheet3!$D$1:$E$7,2,0))","v":""},{"$f":"IF(BZ$5=\"\",\"\",VLOOKUP(WEEKDAY(DATE($A$2,$A$3+$A$1-1,BZ5),2),Sheet3!$D$1:$E$7,2,0))","v":""},{"$f":"IF(CA$5=\"\",\"\",VLOOKUP(WEEKDAY(DATE($A$2,$A$3+$A$1-1,CA5),2),Sheet3!$D$1:$E$7,2,0))","v":""},{"$f":"IF(CB$5=\"\",\"\",VLOOKUP(WEEKDAY(DATE($A$2,$A$3+$A$1-1,CB5),2),Sheet3!$D$1:$E$7,2,0))","v":""},{"$f":"IF(CC$5=\"\",\"\",VLOOKUP(WEEKDAY(DATE($A$2,$A$3+$A$1-1,CC5),2),Sheet3!$D$1:$E$7,2,0))","v":""},{"$f":"IF(CD$5=\"\",\"\",VLOOKUP(WEEKDAY(DATE($A$2,$A$3+$A$1-1,CD5),2),Sheet3!$D$1:$E$7,2,0))","v":""},{"$f":"IF(CE$5=\"\",\"\",VLOOKUP(WEEKDAY(DATE($A$2,$A$3+$A$1-1,CE5),2),Sheet3!$D$1:$E$7,2,0))","v":""},{"$f":"IF(CF$5=\"\",\"\",VLOOKUP(WEEKDAY(DATE($A$2,$A$3+$A$1-1,CF5),2),Sheet3!$D$1:$E$7,2,0))","v":""},{"$f":"IF(CG$5=\"\",\"\",VLOOKUP(WEEKDAY(DATE($A$2,$A$3+$A$1-1,CG5),2),Sheet3!$D$1:$E$7,2,0))","v":""},{"$f":"IF(CH$5=\"\",\"\",VLOOKUP(WEEKDAY(DATE($A$2,$A$3+$A$1-1,CH5),2),Sheet3!$D$1:$E$7,2,0))","v":""},{"$f":"IF(CI$5=\"\",\"\",VLOOKUP(WEEKDAY(DATE($A$2,$A$3+$A$1-1,CI5),2),Sheet3!$D$1:$E$7,2,0))","v":""},{"$f":"IF(CJ$5=\"\",\"\",VLOOKUP(WEEKDAY(DATE($A$2,$A$3+$A$1-1,CJ5),2),Sheet3!$D$1:$E$7,2,0))","v":""},{"$f":"IF(CK$5=\"\",\"\",VLOOKUP(WEEKDAY(DATE($A$2,$A$3+$A$1-1,CK5),2),Sheet3!$D$1:$E$7,2,0))","v":""},{"$f":"IF(CL$5=\"\",\"\",VLOOKUP(WEEKDAY(DATE($A$2,$A$3+$A$1-1,CL5),2),Sheet3!$D$1:$E$7,2,0))","v":""},{"$f":"IF(CM$5=\"\",\"\",VLOOKUP(WEEKDAY(DATE($A$2,$A$3+$A$1-1,CM5),2),Sheet3!$D$1:$E$7,2,0))","v":""},{"$f":"IF(CN$5=\"\",\"\",VLOOKUP(WEEKDAY(DATE($A$2,$A$3+$A$1-1,CN5),2),Sheet3!$D$1:$E$7,2,0))","v":""},{"$f":"IF(CO$5=\"\",\"\",VLOOKUP(WEEKDAY(DATE($A$2,$A$3+$A$1-1,CO5),2),Sheet3!$D$1:$E$7,2,0))","v":""},{"$f":"IF(CP$5=\"\",\"\",VLOOKUP(WEEKDAY(DATE($A$2,$A$3+$A$1-1,CP5),2),Sheet3!$D$1:$E$7,2,0))","v":""},{"$f":"IF(CQ$5=\"\",\"\",VLOOKUP(WEEKDAY(DATE($A$2,$A$3+$A$1-1,CQ5),2),Sheet3!$D$1:$E$7,2,0))","v":""},{"$f":"IF(CR$5=\"\",\"\",VLOOKUP(WEEKDAY(DATE($A$2,$A$3+$A$1-1,CR5),2),Sheet3!$D$1:$E$7,2,0))","v":""},{"$f":"IF(CS$5=\"\",\"\",VLOOKUP(WEEKDAY(DATE($A$2,$A$3+$A$1-1,CS5),2),Sheet3!$D$1:$E$7,2,0))","v":""},{"$f":"IF(CT$5=\"\",\"\",VLOOKUP(WEEKDAY(DATE($A$2,$A$3+$A$1-1,CT5),2),Sheet3!$D$1:$E$7,2,0))","v":""},{"$f":"IF(CU$5=\"\",\"\",VLOOKUP(WEEKDAY(DATE($A$2,$A$3+$A$1-1,CU5),2),Sheet3!$D$1:$E$7,2,0))","v":""},{"$f":"IF(CV$5=\"\",\"\",VLOOKUP(WEEKDAY(DATE($A$2,$A$3+$A$1-1,CV5),2),Sheet3!$D$1:$E$7,2,0))","v":""},{"$f":"IF(CW$5=\"\",\"\",VLOOKUP(WEEKDAY(DATE($A$2,$A$3+$A$1-1,CW5),2),Sheet3!$D$1:$E$7,2,0))","v":""},{"$f":"IF(CX$5=\"\",\"\",VLOOKUP(WEEKDAY(DATE($A$2,$A$3+$A$1-1,CX5),2),Sheet3!$D$1:$E$7,2,0))","v":""},{"$f":"IF(CY$5=\"\",\"\",VLOOKUP(WEEKDAY(DATE($A$2,$A$3+$A$1-1,CY5),2),Sheet3!$D$1:$E$7,2,0))","v":""},{"$f":"IF(CZ$5=\"\",\"\",VLOOKUP(WEEKDAY(DATE($A$2,$A$3+$A$1-1,CZ5),2),Sheet3!$D$1:$E$7,2,0))","v":""},{"$f":"IF(DA$5=\"\",\"\",VLOOKUP(WEEKDAY(DATE($A$2,$A$3+$A$1-1,DA5),2),Sheet3!$D$1:$E$7,2,0))","v":""},{"$f":"IF(DB$5=\"\",\"\",VLOOKUP(WEEKDAY(DATE($A$2,$A$3+$A$1-1,DB5),2),Sheet3!$D$1:$E$7,2,0))","v":""},{"$f":"IF(DC$5=\"\",\"\",VLOOKUP(WEEKDAY(DATE($A$2,$A$3+$A$1-1,DC5),2),Sheet3!$D$1:$E$7,2,0))","v":""},{"$f":"IF(DD$5=\"\",\"\",VLOOKUP(WEEKDAY(DATE($A$2,$A$3+$A$1-1,DD5),2),Sheet3!$D$1:$E$7,2,0))","v":""},{"$f":"IF(DE$5=\"\",\"\",VLOOKUP(WEEKDAY(DATE($A$2,$A$3+$A$1-1,DE5),2),Sheet3!$D$1:$E$7,2,0))","v":""},{"$f":"IF(DF$5=\"\",\"\",VLOOKUP(WEEKDAY(DATE($A$2,$A$3+$A$1-1,DF5),2),Sheet3!$D$1:$E$7,2,0))","v":""},{"$f":"IF(DG$5=\"\",\"\",VLOOKUP(WEEKDAY(DATE($A$2,$A$3+$A$1-1,DG5),2),Sheet3!$D$1:$E$7,2,0))","v":""},{"$f":"IF(DH$5=\"\",\"\",VLOOKUP(WEEKDAY(DATE($A$2,$A$3+$A$1-1,DH5),2),Sheet3!$D$1:$E$7,2,0))","v":""},{"$f":"IF(DI$5=\"\",\"\",VLOOKUP(WEEKDAY(DATE($A$2,$A$3+$A$1-1,DI5),2),Sheet3!$D$1:$E$7,2,0))","v":""},{"$f":"IF(DJ$5=\"\",\"\",VLOOKUP(WEEKDAY(DATE($A$2,$A$3+$A$1-1,DJ5),2),Sheet3!$D$1:$E$7,2,0))","v":""},{"$f":"IF(DK$5=\"\",\"\",VLOOKUP(WEEKDAY(DATE($A$2,$A$3+$A$1-1,DK5),2),Sheet3!$D$1:$E$7,2,0))","v":""},{"$f":"IF(DL$5=\"\",\"\",VLOOKUP(WEEKDAY(DATE($A$2,$A$3+$A$1-1,DL5),2),Sheet3!$D$1:$E$7,2,0))","v":""},{"$f":"IF(DM$5=\"\",\"\",VLOOKUP(WEEKDAY(DATE($A$2,$A$3+$A$1-1,DM5),2),Sheet3!$D$1:$E$7,2,0))","v":""},{"$f":"IF(DN$5=\"\",\"\",VLOOKUP(WEEKDAY(DATE($A$2,$A$3+$A$1-1,DN5),2),Sheet3!$D$1:$E$7,2,0))","v":""},{"$f":"IF(DO$5=\"\",\"\",VLOOKUP(WEEKDAY(DATE($A$2,$A$3+$A$1-1,DO5),2),Sheet3!$D$1:$E$7,2,0))","v":""},{"$f":"IF(DP$5=\"\",\"\",VLOOKUP(WEEKDAY(DATE($A$2,$A$3+$A$1-1,DP5),2),Sheet3!$D$1:$E$7,2,0))","v":""},{"$f":"IF(DQ$5=\"\",\"\",VLOOKUP(WEEKDAY(DATE($A$2,$A$3+$A$1-1,DQ5),2),Sheet3!$D$1:$E$7,2,0))","v":""},{"$f":"IF(DR$5=\"\",\"\",VLOOKUP(WEEKDAY(DATE($A$2,$A$3+$A$1-1,DR5),2),Sheet3!$D$1:$E$7,2,0))","v":""},{"$f":"IF(DS$5=\"\",\"\",VLOOKUP(WEEKDAY(DATE($A$2,$A$3+$A$1-1,DS5),2),Sheet3!$D$1:$E$7,2,0))","v":""},{"$f":"IF(DT$5=\"\",\"\",VLOOKUP(WEEKDAY(DATE($A$2,$A$3+$A$1-1,DT5),2),Sheet3!$D$1:$E$7,2,0))","v":""},{"$f":"IF(DU$5=\"\",\"\",VLOOKUP(WEEKDAY(DATE($A$2,$A$3+$A$1-1,DU5),2),Sheet3!$D$1:$E$7,2,0))","v":""},{"$f":"IF(DV$5=\"\",\"\",VLOOKUP(WEEKDAY(DATE($A$2,$A$3+$A$1-1,DV5),2),Sheet3!$D$1:$E$7,2,0))","v":""},{"$f":"IF(DW$5=\"\",\"\",VLOOKUP(WEEKDAY(DATE($A$2,$A$3+$A$1-1,DW5),2),Sheet3!$D$1:$E$7,2,0))","v":""},{"$f":"IF(DX$5=\"\",\"\",VLOOKUP(WEEKDAY(DATE($A$2,$A$3+$A$1-1,DX5),2),Sheet3!$D$1:$E$7,2,0))","v":""},{"$f":"IF(DY$5=\"\",\"\",VLOOKUP(WEEKDAY(DATE($A$2,$A$3+$A$1-1,DY5),2),Sheet3!$D$1:$E$7,2,0))","v":""},{"$f":"IF(DZ$5=\"\",\"\",VLOOKUP(WEEKDAY(DATE($A$2,$A$3+$A$1-1,DZ5),2),Sheet3!$D$1:$E$7,2,0))","v":""},{"$f":"IF(EA$5=\"\",\"\",VLOOKUP(WEEKDAY(DATE($A$2,$A$3+$A$1-1,EA5),2),Sheet3!$D$1:$E$7,2,0))","v":""},{"$f":"IF(EB$5=\"\",\"\",VLOOKUP(WEEKDAY(DATE($A$2,$A$3+$A$1-1,EB5),2),Sheet3!$D$1:$E$7,2,0))","v":""},{"$f":"IF(EC$5=\"\",\"\",VLOOKUP(WEEKDAY(DATE($A$2,$A$3+$A$1-1,EC5),2),Sheet3!$D$1:$E$7,2,0))","v":""},{"$f":"IF(ED$5=\"\",\"\",VLOOKUP(WEEKDAY(DATE($A$2,$A$3+$A$1-1,ED5),2),Sheet3!$D$1:$E$7,2,0))","v":""},{"$f":"IF(EE$5=\"\",\"\",VLOOKUP(WEEKDAY(DATE($A$2,$A$3+$A$1-1,EE5),2),Sheet3!$D$1:$E$7,2,0))","v":""},{"$f":"IF(EF$5=\"\",\"\",VLOOKUP(WEEKDAY(DATE($A$2,$A$3+$A$1-1,EF5),2),Sheet3!$D$1:$E$7,2,0))","v":""},{"$f":"IF(EG$5=\"\",\"\",VLOOKUP(WEEKDAY(DATE($A$2,$A$3+$A$1-1,EG5),2),Sheet3!$D$1:$E$7,2,0))","v":""},{"$f":"IF(EH$5=\"\",\"\",VLOOKUP(WEEKDAY(DATE($A$2,$A$3+$A$1-1,EH5),2),Sheet3!$D$1:$E$7,2,0))","v":""},{"$f":"IF(EI$5=\"\",\"\",VLOOKUP(WEEKDAY(DATE($A$2,$A$3+$A$1-1,EI5),2),Sheet3!$D$1:$E$7,2,0))","v":""},{"$f":"IF(EJ$5=\"\",\"\",VLOOKUP(WEEKDAY(DATE($A$2,$A$3+$A$1-1,EJ5),2),Sheet3!$D$1:$E$7,2,0))","v":""},{"$f":"IF(EK$5=\"\",\"\",VLOOKUP(WEEKDAY(DATE($A$2,$A$3+$A$1-1,EK5),2),Sheet3!$D$1:$E$7,2,0))","v":""},{"$f":"IF(EL$5=\"\",\"\",VLOOKUP(WEEKDAY(DATE($A$2,$A$3+$A$1-1,EL5),2),Sheet3!$D$1:$E$7,2,0))","v":""},{"$f":"IF(EM$5=\"\",\"\",VLOOKUP(WEEKDAY(DATE($A$2,$A$3+$A$1-1,EM5),2),Sheet3!$D$1:$E$7,2,0))","v":""},{"$f":"IF(EN$5=\"\",\"\",VLOOKUP(WEEKDAY(DATE($A$2,$A$3+$A$1-1,EN5),2),Sheet3!$D$1:$E$7,2,0))","v":""},{"$f":"IF(EO$5=\"\",\"\",VLOOKUP(WEEKDAY(DATE($A$2,$A$3+$A$1-1,EO5),2),Sheet3!$D$1:$E$7,2,0))","v":""},{"$f":"IF(EP$5=\"\",\"\",VLOOKUP(WEEKDAY(DATE($A$2,$A$3+$A$1-1,EP5),2),Sheet3!$D$1:$E$7,2,0))","v":""},{"$f":"IF(EQ$5=\"\",\"\",VLOOKUP(WEEKDAY(DATE($A$2,$A$3+$A$1-1,EQ5),2),Sheet3!$D$1:$E$7,2,0))","v":""},{"$f":"IF(ER$5=\"\",\"\",VLOOKUP(WEEKDAY(DATE($A$2,$A$3+$A$1-1,ER5),2),Sheet3!$D$1:$E$7,2,0))","v":""},{"$f":"IF(ES$5=\"\",\"\",VLOOKUP(WEEKDAY(DATE($A$2,$A$3+$A$1-1,ES5),2),Sheet3!$D$1:$E$7,2,0))","v":""},{"$f":"IF(ET$5=\"\",\"\",VLOOKUP(WEEKDAY(DATE($A$2,$A$3+$A$1-1,ET5),2),Sheet3!$D$1:$E$7,2,0))","v":""},{"$f":"IF(EU$5=\"\",\"\",VLOOKUP(WEEKDAY(DATE($A$2,$A$3+$A$1-1,EU5),2),Sheet3!$D$1:$E$7,2,0))","v":""},{"$f":"IF(EV$5=\"\",\"\",VLOOKUP(WEEKDAY(DATE($A$2,$A$3+$A$1-1,EV5),2),Sheet3!$D$1:$E$7,2,0))","v":""},{"$f":"IF(EW$5=\"\",\"\",VLOOKUP(WEEKDAY(DATE($A$2,$A$3+$A$1-1,EW5),2),Sheet3!$D$1:$E$7,2,0))","v":""},{"$f":"IF(EX$5=\"\",\"\",VLOOKUP(WEEKDAY(DATE($A$2,$A$3+$A$1-1,EX5),2),Sheet3!$D$1:$E$7,2,0))","v":""},{"$f":"IF(EY$5=\"\",\"\",VLOOKUP(WEEKDAY(DATE($A$2,$A$3+$A$1-1,EY5),2),Sheet3!$D$1:$E$7,2,0))","v":""},{"$f":"IF(EZ$5=\"\",\"\",VLOOKUP(WEEKDAY(DATE($A$2,$A$3+$A$1-1,EZ5),2),Sheet3!$D$1:$E$7,2,0))","v":""},{"$f":"IF(FA$5=\"\",\"\",VLOOKUP(WEEKDAY(DATE($A$2,$A$3+$A$1-1,FA5),2),Sheet3!$D$1:$E$7,2,0))","v":""},{"$f":"IF(FB$5=\"\",\"\",VLOOKUP(WEEKDAY(DATE($A$2,$A$3+$A$1-1,FB5),2),Sheet3!$D$1:$E$7,2,0))","v":""},{"$f":"IF(FC$5=\"\",\"\",VLOOKUP(WEEKDAY(DATE($A$2,$A$3+$A$1-1,FC5),2),Sheet3!$D$1:$E$7,2,0))","v":""},{"$f":"IF(FD$5=\"\",\"\",VLOOKUP(WEEKDAY(DATE($A$2,$A$3+$A$1-1,FD5),2),Sheet3!$D$1:$E$7,2,0))","v":""},{"$f":"IF(FE$5=\"\",\"\",VLOOKUP(WEEKDAY(DATE($A$2,$A$3+$A$1-1,FE5),2),Sheet3!$D$1:$E$7,2,0))","v":""},{"$f":"IF(FF$5=\"\",\"\",VLOOKUP(WEEKDAY(DATE($A$2,$A$3+$A$1-1,FF5),2),Sheet3!$D$1:$E$7,2,0))","v":""},{"$f":"IF(FG$5=\"\",\"\",VLOOKUP(WEEKDAY(DATE($A$2,$A$3+$A$1-1,FG5),2),Sheet3!$D$1:$E$7,2,0))","v":""},{"$f":"IF(FH$5=\"\",\"\",VLOOKUP(WEEKDAY(DATE($A$2,$A$3+$A$1-1,FH5),2),Sheet3!$D$1:$E$7,2,0))","v":""},{"$f":"IF(FI$5=\"\",\"\",VLOOKUP(WEEKDAY(DATE($A$2,$A$3+$A$1-1,FI5),2),Sheet3!$D$1:$E$7,2,0))","v":""},{"$f":"IF(FJ$5=\"\",\"\",VLOOKUP(WEEKDAY(DATE($A$2,$A$3+$A$1-1,FJ5),2),Sheet3!$D$1:$E$7,2,0))","v":""},{"$f":"IF(FK$5=\"\",\"\",VLOOKUP(WEEKDAY(DATE($A$2,$A$3+$A$1-1,FK5),2),Sheet3!$D$1:$E$7,2,0))","v":""},{"$f":"IF(FL$5=\"\",\"\",VLOOKUP(WEEKDAY(DATE($A$2,$A$3+$A$1-1,FL5),2),Sheet3!$D$1:$E$7,2,0))","v":""},{"$f":"IF(FM$5=\"\",\"\",VLOOKUP(WEEKDAY(DATE($A$2,$A$3+$A$1-1,FM5),2),Sheet3!$D$1:$E$7,2,0))","v":""},{"$f":"IF(FN$5=\"\",\"\",VLOOKUP(WEEKDAY(DATE($A$2,$A$3+$A$1-1,FN5),2),Sheet3!$D$1:$E$7,2,0))","v":""},{"$f":"IF(FO$5=\"\",\"\",VLOOKUP(WEEKDAY(DATE($A$2,$A$3+$A$1-1,FO5),2),Sheet3!$D$1:$E$7,2,0))","v":""},{"$f":"IF(FP$5=\"\",\"\",VLOOKUP(WEEKDAY(DATE($A$2,$A$3+$A$1-1,FP5),2),Sheet3!$D$1:$E$7,2,0))","v":""},{"$f":"IF(FQ$5=\"\",\"\",VLOOKUP(WEEKDAY(DATE($A$2,$A$3+$A$1-1,FQ5),2),Sheet3!$D$1:$E$7,2,0))","v":""},{"$f":"IF(FR$5=\"\",\"\",VLOOKUP(WEEKDAY(DATE($A$2,$A$3+$A$1-1,FR5),2),Sheet3!$D$1:$E$7,2,0))","v":""},{"$f":"IF(FS$5=\"\",\"\",VLOOKUP(WEEKDAY(DATE($A$2,$A$3+$A$1-1,FS5),2),Sheet3!$D$1:$E$7,2,0))","v":""},{"$f":"IF(FT$5=\"\",\"\",VLOOKUP(WEEKDAY(DATE($A$2,$A$3+$A$1-1,FT5),2),Sheet3!$D$1:$E$7,2,0))","v":""},{"$f":"IF(FU$5=\"\",\"\",VLOOKUP(WEEKDAY(DATE($A$2,$A$3+$A$1-1,FU5),2),Sheet3!$D$1:$E$7,2,0))","v":""},{"$f":"IF(FV$5=\"\",\"\",VLOOKUP(WEEKDAY(DATE($A$2,$A$3+$A$1-1,FV5),2),Sheet3!$D$1:$E$7,2,0))","v":""},{"$f":"IF(FW$5=\"\",\"\",VLOOKUP(WEEKDAY(DATE($A$2,$A$3+$A$1-1,FW5),2),Sheet3!$D$1:$E$7,2,0))","v":""},{"$f":"IF(FX$5=\"\",\"\",VLOOKUP(WEEKDAY(DATE($A$2,$A$3+$A$1-1,FX5),2),Sheet3!$D$1:$E$7,2,0))","v":""},{"$f":"IF(FY$5=\"\",\"\",VLOOKUP(WEEKDAY(DATE($A$2,$A$3+$A$1-1,FY5),2),Sheet3!$D$1:$E$7,2,0))","v":""},{"$f":"IF(FZ$5=\"\",\"\",VLOOKUP(WEEKDAY(DATE($A$2,$A$3+$A$1-1,FZ5),2),Sheet3!$D$1:$E$7,2,0))","v":""},{"$f":"IF(GA$5=\"\",\"\",VLOOKUP(WEEKDAY(DATE($A$2,$A$3+$A$1-1,GA5),2),Sheet3!$D$1:$E$7,2,0))","v":""},{"$f":"IF(GB$5=\"\",\"\",VLOOKUP(WEEKDAY(DATE($A$2,$A$3+$A$1-1,GB5),2),Sheet3!$D$1:$E$7,2,0))","v":""},{"$f":"IF(GC$5=\"\",\"\",VLOOKUP(WEEKDAY(DATE($A$2,$A$3+$A$1-1,GC5),2),Sheet3!$D$1:$E$7,2,0))","v":""},{"$f":"IF(GD$5=\"\",\"\",VLOOKUP(WEEKDAY(DATE($A$2,$A$3+$A$1-1,GD5),2),Sheet3!$D$1:$E$7,2,0))","v":""},{"$f":"IF(GE$5=\"\",\"\",VLOOKUP(WEEKDAY(DATE($A$2,$A$3+$A$1-1,GE5),2),Sheet3!$D$1:$E$7,2,0))","v":""},{"$f":"IF(GF$5=\"\",\"\",VLOOKUP(WEEKDAY(DATE($A$2,$A$3+$A$1-1,GF5),2),Sheet3!$D$1:$E$7,2,0))","v":""},{"$f":"IF(GG$5=\"\",\"\",VLOOKUP(WEEKDAY(DATE($A$2,$A$3+$A$1-1,GG5),2),Sheet3!$D$1:$E$7,2,0))","v":""},{"$f":"IF(GH$5=\"\",\"\",VLOOKUP(WEEKDAY(DATE($A$2,$A$3+$A$1-1,GH5),2),Sheet3!$D$1:$E$7,2,0))","v":""},{"$f":"IF(GI$5=\"\",\"\",VLOOKUP(WEEKDAY(DATE($A$2,$A$3+$A$1-1,GI5),2),Sheet3!$D$1:$E$7,2,0))","v":""},{"$f":"IF(GJ$5=\"\",\"\",VLOOKUP(WEEKDAY(DATE($A$2,$A$3+$A$1-1,GJ5),2),Sheet3!$D$1:$E$7,2,0))","v":""},{"$f":"IF(GK$5=\"\",\"\",VLOOKUP(WEEKDAY(DATE($A$2,$A$3+$A$1-1,GK5),2),Sheet3!$D$1:$E$7,2,0))","v":""},{"$f":"IF(GL$5=\"\",\"\",VLOOKUP(WEEKDAY(DATE($A$2,$A$3+$A$1-1,GL5),2),Sheet3!$D$1:$E$7,2,0))","v":""},{"$f":"IF(GM$5=\"\",\"\",VLOOKUP(WEEKDAY(DATE($A$2,$A$3+$A$1-1,GM5),2),Sheet3!$D$1:$E$7,2,0))","v":""},{"$f":"IF(GN$5=\"\",\"\",VLOOKUP(WEEKDAY(DATE($A$2,$A$3+$A$1-1,GN5),2),Sheet3!$D$1:$E$7,2,0))","v":""},{"$f":"IF(GO$5=\"\",\"\",VLOOKUP(WEEKDAY(DATE($A$2,$A$3+$A$1-1,GO5),2),Sheet3!$D$1:$E$7,2,0))","v":""},{"$f":"IF(GP$5=\"\",\"\",VLOOKUP(WEEKDAY(DATE($A$2,$A$3+$A$1-1,GP5),2),Sheet3!$D$1:$E$7,2,0))","v":""},{"$f":"IF(GQ$5=\"\",\"\",VLOOKUP(WEEKDAY(DATE($A$2,$A$3+$A$1-1,GQ5),2),Sheet3!$D$1:$E$7,2,0))","v":""},{"$f":"IF(GR$5=\"\",\"\",VLOOKUP(WEEKDAY(DATE($A$2,$A$3+$A$1-1,GR5),2),Sheet3!$D$1:$E$7,2,0))","v":""},{"$f":"IF(GS$5=\"\",\"\",VLOOKUP(WEEKDAY(DATE($A$2,$A$3+$A$1-1,GS5),2),Sheet3!$D$1:$E$7,2,0))","v":""},{"$f":"IF(GT$5=\"\",\"\",VLOOKUP(WEEKDAY(DATE($A$2,$A$3+$A$1-1,GT5),2),Sheet3!$D$1:$E$7,2,0))","v":""},{"$f":"IF(GU$5=\"\",\"\",VLOOKUP(WEEKDAY(DATE($A$2,$A$3+$A$1-1,GU5),2),Sheet3!$D$1:$E$7,2,0))","v":""},{"$f":"IF(GV$5=\"\",\"\",VLOOKUP(WEEKDAY(DATE($A$2,$A$3+$A$1-1,GV5),2),Sheet3!$D$1:$E$7,2,0))","v":""},{"$f":"IF(GW$5=\"\",\"\",VLOOKUP(WEEKDAY(DATE($A$2,$A$3+$A$1-1,GW5),2),Sheet3!$D$1:$E$7,2,0))","v":""},{"$f":"IF(GX$5=\"\",\"\",VLOOKUP(WEEKDAY(DATE($A$2,$A$3+$A$1-1,GX5),2),Sheet3!$D$1:$E$7,2,0))","v":""},{"$f":"IF(GY$5=\"\",\"\",VLOOKUP(WEEKDAY(DATE($A$2,$A$3+$A$1-1,GY5),2),Sheet3!$D$1:$E$7,2,0))","v":""},{"$f":"IF(GZ$5=\"\",\"\",VLOOKUP(WEEKDAY(DATE($A$2,$A$3+$A$1-1,GZ5),2),Sheet3!$D$1:$E$7,2,0))","v":""},{"$f":"IF(HA$5=\"\",\"\",VLOOKUP(WEEKDAY(DATE($A$2,$A$3+$A$1-1,HA5),2),Sheet3!$D$1:$E$7,2,0))","v":""},{"$f":"IF(HB$5=\"\",\"\",VLOOKUP(WEEKDAY(DATE($A$2,$A$3+$A$1-1,HB5),2),Sheet3!$D$1:$E$7,2,0))","v":""},{"$f":"IF(HC$5=\"\",\"\",VLOOKUP(WEEKDAY(DATE($A$2,$A$3+$A$1-1,HC5),2),Sheet3!$D$1:$E$7,2,0))","v":""},{"$f":"IF(HD$5=\"\",\"\",VLOOKUP(WEEKDAY(DATE($A$2,$A$3+$A$1-1,HD5),2),Sheet3!$D$1:$E$7,2,0))","v":""},{"$f":"IF(HE$5=\"\",\"\",VLOOKUP(WEEKDAY(DATE($A$2,$A$3+$A$1-1,HE5),2),Sheet3!$D$1:$E$7,2,0))","v":""},{"$f":"IF(HF$5=\"\",\"\",VLOOKUP(WEEKDAY(DATE($A$2,$A$3+$A$1-1,HF5),2),Sheet3!$D$1:$E$7,2,0))","v":""},{"$f":"IF(HG$5=\"\",\"\",VLOOKUP(WEEKDAY(DATE($A$2,$A$3+$A$1-1,HG5),2),Sheet3!$D$1:$E$7,2,0))","v":""},{"$f":"IF(HH$5=\"\",\"\",VLOOKUP(WEEKDAY(DATE($A$2,$A$3+$A$1-1,HH5),2),Sheet3!$D$1:$E$7,2,0))","v":""},{"$f":"IF(HI$5=\"\",\"\",VLOOKUP(WEEKDAY(DATE($A$2,$A$3+$A$1-1,HI5),2),Sheet3!$D$1:$E$7,2,0))","v":""},{"$f":"IF(HJ$5=\"\",\"\",VLOOKUP(WEEKDAY(DATE($A$2,$A$3+$A$1-1,HJ5),2),Sheet3!$D$1:$E$7,2,0))","v":""},{"$f":"IF(HK$5=\"\",\"\",VLOOKUP(WEEKDAY(DATE($A$2,$A$3+$A$1-1,HK5),2),Sheet3!$D$1:$E$7,2,0))","v":""},{"$f":"IF(HL$5=\"\",\"\",VLOOKUP(WEEKDAY(DATE($A$2,$A$3+$A$1-1,HL5),2),Sheet3!$D$1:$E$7,2,0))","v":""},{"$f":"IF(HM$5=\"\",\"\",VLOOKUP(WEEKDAY(DATE($A$2,$A$3+$A$1-1,HM5),2),Sheet3!$D$1:$E$7,2,0))","v":""},{"$f":"IF(HN$5=\"\",\"\",VLOOKUP(WEEKDAY(DATE($A$2,$A$3+$A$1-1,HN5),2),Sheet3!$D$1:$E$7,2,0))","v":""},{"$f":"IF(HO$5=\"\",\"\",VLOOKUP(WEEKDAY(DATE($A$2,$A$3+$A$1-1,HO5),2),Sheet3!$D$1:$E$7,2,0))","v":""},{"$f":"IF(HP$5=\"\",\"\",VLOOKUP(WEEKDAY(DATE($A$2,$A$3+$A$1-1,HP5),2),Sheet3!$D$1:$E$7,2,0))","v":""},{"$f":"IF(HQ$5=\"\",\"\",VLOOKUP(WEEKDAY(DATE($A$2,$A$3+$A$1-1,HQ5),2),Sheet3!$D$1:$E$7,2,0))","v":""},{"$f":"IF(HR$5=\"\",\"\",VLOOKUP(WEEKDAY(DATE($A$2,$A$3+$A$1-1,HR5),2),Sheet3!$D$1:$E$7,2,0))","v":""},{"$f":"IF(HS$5=\"\",\"\",VLOOKUP(WEEKDAY(DATE($A$2,$A$3+$A$1-1,HS5),2),Sheet3!$D$1:$E$7,2,0))","v":""},{"$f":"IF(HT$5=\"\",\"\",VLOOKUP(WEEKDAY(DATE($A$2,$A$3+$A$1-1,HT5),2),Sheet3!$D$1:$E$7,2,0))","v":""},{"$f":"IF(HU$5=\"\",\"\",VLOOKUP(WEEKDAY(DATE($A$2,$A$3+$A$1-1,HU5),2),Sheet3!$D$1:$E$7,2,0))","v":""},{"$f":"IF(HV$5=\"\",\"\",VLOOKUP(WEEKDAY(DATE($A$2,$A$3+$A$1-1,HV5),2),Sheet3!$D$1:$E$7,2,0))","v":""},{"$f":"IF(HW$5=\"\",\"\",VLOOKUP(WEEKDAY(DATE($A$2,$A$3+$A$1-1,HW5),2),Sheet3!$D$1:$E$7,2,0))","v":""},{"$f":"IF(HX$5=\"\",\"\",VLOOKUP(WEEKDAY(DATE($A$2,$A$3+$A$1-1,HX5),2),Sheet3!$D$1:$E$7,2,0))","v":""},{"$f":"IF(HY$5=\"\",\"\",VLOOKUP(WEEKDAY(DATE($A$2,$A$3+$A$1-1,HY5),2),Sheet3!$D$1:$E$7,2,0))","v":""},{"$f":"IF(HZ$5=\"\",\"\",VLOOKUP(WEEKDAY(DATE($A$2,$A$3+$A$1-1,HZ5),2),Sheet3!$D$1:$E$7,2,0))","v":""},{"$f":"IF(IA$5=\"\",\"\",VLOOKUP(WEEKDAY(DATE($A$2,$A$3+$A$1-1,IA5),2),Sheet3!$D$1:$E$7,2,0))","v":""},{"$f":"IF(IB$5=\"\",\"\",VLOOKUP(WEEKDAY(DATE($A$2,$A$3+$A$1-1,IB5),2),Sheet3!$D$1:$E$7,2,0))","v":""},{"$f":"IF(IC$5=\"\",\"\",VLOOKUP(WEEKDAY(DATE($A$2,$A$3+$A$1-1,IC5),2),Sheet3!$D$1:$E$7,2,0))","v":""},{"$f":"IF(ID$5=\"\",\"\",VLOOKUP(WEEKDAY(DATE($A$2,$A$3+$A$1-1,ID5),2),Sheet3!$D$1:$E$7,2,0))","v":""},{"$f":"IF(IE$5=\"\",\"\",VLOOKUP(WEEKDAY(DATE($A$2,$A$3+$A$1-1,IE5),2),Sheet3!$D$1:$E$7,2,0))","v":""},{"$f":"IF(IF$5=\"\",\"\",VLOOKUP(WEEKDAY(DATE($A$2,$A$3+$A$1-1,IF5),2),Sheet3!$D$1:$E$7,2,0))","v":""},{"$f":"IF(IG$5=\"\",\"\",VLOOKUP(WEEKDAY(DATE($A$2,$A$3+$A$1-1,IG5),2),Sheet3!$D$1:$E$7,2,0))","v":""},{"$f":"IF(IH$5=\"\",\"\",VLOOKUP(WEEKDAY(DATE($A$2,$A$3+$A$1-1,IH5),2),Sheet3!$D$1:$E$7,2,0))","v":""},{"$f":"IF(II$5=\"\",\"\",VLOOKUP(WEEKDAY(DATE($A$2,$A$3+$A$1-1,II5),2),Sheet3!$D$1:$E$7,2,0))","v":""},{"$f":"IF(IJ$5=\"\",\"\",VLOOKUP(WEEKDAY(DATE($A$2,$A$3+$A$1-1,IJ5),2),Sheet3!$D$1:$E$7,2,0))","v":""},{"$f":"IF(IK$5=\"\",\"\",VLOOKUP(WEEKDAY(DATE($A$2,$A$3+$A$1-1,IK5),2),Sheet3!$D$1:$E$7,2,0))","v":""},{"$f":"IF(IL$5=\"\",\"\",VLOOKUP(WEEKDAY(DATE($A$2,$A$3+$A$1-1,IL5),2),Sheet3!$D$1:$E$7,2,0))","v":""},{"$f":"IF(IM$5=\"\",\"\",VLOOKUP(WEEKDAY(DATE($A$2,$A$3+$A$1-1,IM5),2),Sheet3!$D$1:$E$7,2,0))","v":""},{"$f":"IF(IN$5=\"\",\"\",VLOOKUP(WEEKDAY(DATE($A$2,$A$3+$A$1-1,IN5),2),Sheet3!$D$1:$E$7,2,0))","v":""},{"$f":"IF(IO$5=\"\",\"\",VLOOKUP(WEEKDAY(DATE($A$2,$A$3+$A$1-1,IO5),2),Sheet3!$D$1:$E$7,2,0))","v":""},{"$f":"IF(IP$5=\"\",\"\",VLOOKUP(WEEKDAY(DATE($A$2,$A$3+$A$1-1,IP5),2),Sheet3!$D$1:$E$7,2,0))","v":""},{"$f":"IF(IQ$5=\"\",\"\",VLOOKUP(WEEKDAY(DATE($A$2,$A$3+$A$1-1,IQ5),2),Sheet3!$D$1:$E$7,2,0))","v":""},{"$f":"IF(IR$5=\"\",\"\",VLOOKUP(WEEKDAY(DATE($A$2,$A$3+$A$1-1,IR5),2),Sheet3!$D$1:$E$7,2,0))","v":""},{"$f":"IF(IS$5=\"\",\"\",VLOOKUP(WEEKDAY(DATE($A$2,$A$3+$A$1-1,IS5),2),Sheet3!$D$1:$E$7,2,0))","v":""},{"$f":"IF(IT$5=\"\",\"\",VLOOKUP(WEEKDAY(DATE($A$2,$A$3+$A$1-1,IT5),2),Sheet3!$D$1:$E$7,2,0))","v":""},{"$f":"IF(IU$5=\"\",\"\",VLOOKUP(WEEKDAY(DATE($A$2,$A$3+$A$1-1,IU5),2),Sheet3!$D$1:$E$7,2,0))","v":""},{"$f":"IF(IV$5=\"\",\"\",VLOOKUP(WEEKDAY(DATE($A$2,$A$3+$A$1-1,IV5),2),Sheet3!$D$1:$E$7,2,0))","v":""},{"$f":"IF(IW$5=\"\",\"\",VLOOKUP(WEEKDAY(DATE($A$2,$A$3+$A$1-1,IW5),2),Sheet3!$D$1:$E$7,2,0))","v":""},{"$f":"IF(IX$5=\"\",\"\",VLOOKUP(WEEKDAY(DATE($A$2,$A$3+$A$1-1,IX5),2),Sheet3!$D$1:$E$7,2,0))","v":""},{"$f":"IF(IY$5=\"\",\"\",VLOOKUP(WEEKDAY(DATE($A$2,$A$3+$A$1-1,IY5),2),Sheet3!$D$1:$E$7,2,0))","v":""},{"$f":"IF(IZ$5=\"\",\"\",VLOOKUP(WEEKDAY(DATE($A$2,$A$3+$A$1-1,IZ5),2),Sheet3!$D$1:$E$7,2,0))","v":""},{"$f":"IF(JA$5=\"\",\"\",VLOOKUP(WEEKDAY(DATE($A$2,$A$3+$A$1-1,JA5),2),Sheet3!$D$1:$E$7,2,0))","v":""},{"$f":"IF(JB$5=\"\",\"\",VLOOKUP(WEEKDAY(DATE($A$2,$A$3+$A$1-1,JB5),2),Sheet3!$D$1:$E$7,2,0))","v":""},{"$f":"IF(JC$5=\"\",\"\",VLOOKUP(WEEKDAY(DATE($A$2,$A$3+$A$1-1,JC5),2),Sheet3!$D$1:$E$7,2,0))","v":""},{"$f":"IF(JD$5=\"\",\"\",VLOOKUP(WEEKDAY(DATE($A$2,$A$3+$A$1-1,JD5),2),Sheet3!$D$1:$E$7,2,0))","v":""},{"$f":"IF(JE$5=\"\",\"\",VLOOKUP(WEEKDAY(DATE($A$2,$A$3+$A$1-1,JE5),2),Sheet3!$D$1:$E$7,2,0))","v":""},{"$f":"IF(JF$5=\"\",\"\",VLOOKUP(WEEKDAY(DATE($A$2,$A$3+$A$1-1,JF5),2),Sheet3!$D$1:$E$7,2,0))","v":""},{"$f":"IF(JG$5=\"\",\"\",VLOOKUP(WEEKDAY(DATE($A$2,$A$3+$A$1-1,JG5),2),Sheet3!$D$1:$E$7,2,0))","v":""},{"$f":"IF(JH$5=\"\",\"\",VLOOKUP(WEEKDAY(DATE($A$2,$A$3+$A$1-1,JH5),2),Sheet3!$D$1:$E$7,2,0))","v":""},{"$f":"IF(JI$5=\"\",\"\",VLOOKUP(WEEKDAY(DATE($A$2,$A$3+$A$1-1,JI5),2),Sheet3!$D$1:$E$7,2,0))","v":""},{"$f":"IF(JJ$5=\"\",\"\",VLOOKUP(WEEKDAY(DATE($A$2,$A$3+$A$1-1,JJ5),2),Sheet3!$D$1:$E$7,2,0))","v":""},{"$f":"IF(JK$5=\"\",\"\",VLOOKUP(WEEKDAY(DATE($A$2,$A$3+$A$1-1,JK5),2),Sheet3!$D$1:$E$7,2,0))","v":""},{"$f":"IF(JL$5=\"\",\"\",VLOOKUP(WEEKDAY(DATE($A$2,$A$3+$A$1-1,JL5),2),Sheet3!$D$1:$E$7,2,0))","v":""},{"$f":"IF(JM$5=\"\",\"\",VLOOKUP(WEEKDAY(DATE($A$2,$A$3+$A$1-1,JM5),2),Sheet3!$D$1:$E$7,2,0))","v":""},{"$f":"IF(JN$5=\"\",\"\",VLOOKUP(WEEKDAY(DATE($A$2,$A$3+$A$1-1,JN5),2),Sheet3!$D$1:$E$7,2,0))","v":""},{"$f":"IF(JO$5=\"\",\"\",VLOOKUP(WEEKDAY(DATE($A$2,$A$3+$A$1-1,JO5),2),Sheet3!$D$1:$E$7,2,0))","v":""},{"$f":"IF(JP$5=\"\",\"\",VLOOKUP(WEEKDAY(DATE($A$2,$A$3+$A$1-1,JP5),2),Sheet3!$D$1:$E$7,2,0))","v":""},{"$f":"IF(JQ$5=\"\",\"\",VLOOKUP(WEEKDAY(DATE($A$2,$A$3+$A$1-1,JQ5),2),Sheet3!$D$1:$E$7,2,0))","v":""},{"$f":"IF(JR$5=\"\",\"\",VLOOKUP(WEEKDAY(DATE($A$2,$A$3+$A$1-1,JR5),2),Sheet3!$D$1:$E$7,2,0))","v":""},{"$f":"IF(JS$5=\"\",\"\",VLOOKUP(WEEKDAY(DATE($A$2,$A$3+$A$1-1,JS5),2),Sheet3!$D$1:$E$7,2,0))","v":""},{"$f":"IF(JT$5=\"\",\"\",VLOOKUP(WEEKDAY(DATE($A$2,$A$3+$A$1-1,JT5),2),Sheet3!$D$1:$E$7,2,0))","v":""},{"$f":"IF(JU$5=\"\",\"\",VLOOKUP(WEEKDAY(DATE($A$2,$A$3+$A$1-1,JU5),2),Sheet3!$D$1:$E$7,2,0))","v":""},{"$f":"IF(JV$5=\"\",\"\",VLOOKUP(WEEKDAY(DATE($A$2,$A$3+$A$1-1,JV5),2),Sheet3!$D$1:$E$7,2,0))","v":""},{"$f":"IF(JW$5=\"\",\"\",VLOOKUP(WEEKDAY(DATE($A$2,$A$3+$A$1-1,JW5),2),Sheet3!$D$1:$E$7,2,0))","v":""},{"$f":"IF(JX$5=\"\",\"\",VLOOKUP(WEEKDAY(DATE($A$2,$A$3+$A$1-1,JX5),2),Sheet3!$D$1:$E$7,2,0))","v":""},{"$f":"IF(JY$5=\"\",\"\",VLOOKUP(WEEKDAY(DATE($A$2,$A$3+$A$1-1,JY5),2),Sheet3!$D$1:$E$7,2,0))","v":""},{"$f":"IF(JZ$5=\"\",\"\",VLOOKUP(WEEKDAY(DATE($A$2,$A$3+$A$1-1,JZ5),2),Sheet3!$D$1:$E$7,2,0))","v":""},{"$f":"IF(KA$5=\"\",\"\",VLOOKUP(WEEKDAY(DATE($A$2,$A$3+$A$1-1,KA5),2),Sheet3!$D$1:$E$7,2,0))","v":""},{"$f":"IF(KB$5=\"\",\"\",VLOOKUP(WEEKDAY(DATE($A$2,$A$3+$A$1-1,KB5),2),Sheet3!$D$1:$E$7,2,0))","v":""},{"$f":"IF(KC$5=\"\",\"\",VLOOKUP(WEEKDAY(DATE($A$2,$A$3+$A$1-1,KC5),2),Sheet3!$D$1:$E$7,2,0))","v":""},{"$f":"IF(KD$5=\"\",\"\",VLOOKUP(WEEKDAY(DATE($A$2,$A$3+$A$1-1,KD5),2),Sheet3!$D$1:$E$7,2,0))","v":""},{"$f":"IF(KE$5=\"\",\"\",VLOOKUP(WEEKDAY(DATE($A$2,$A$3+$A$1-1,KE5),2),Sheet3!$D$1:$E$7,2,0))","v":""},{"$f":"IF(KF$5=\"\",\"\",VLOOKUP(WEEKDAY(DATE($A$2,$A$3+$A$1-1,KF5),2),Sheet3!$D$1:$E$7,2,0))","v":""},{"$f":"IF(KG$5=\"\",\"\",VLOOKUP(WEEKDAY(DATE($A$2,$A$3+$A$1-1,KG5),2),Sheet3!$D$1:$E$7,2,0))","v":""},{"$f":"IF(KH$5=\"\",\"\",VLOOKUP(WEEKDAY(DATE($A$2,$A$3+$A$1-1,KH5),2),Sheet3!$D$1:$E$7,2,0))","v":""},{"$f":"IF(KI$5=\"\",\"\",VLOOKUP(WEEKDAY(DATE($A$2,$A$3+$A$1-1,KI5),2),Sheet3!$D$1:$E$7,2,0))","v":""},{"$f":"IF(KJ$5=\"\",\"\",VLOOKUP(WEEKDAY(DATE($A$2,$A$3+$A$1-1,KJ5),2),Sheet3!$D$1:$E$7,2,0))","v":""},{"$f":"IF(KK$5=\"\",\"\",VLOOKUP(WEEKDAY(DATE($A$2,$A$3+$A$1-1,KK5),2),Sheet3!$D$1:$E$7,2,0))","v":""},{"$f":"IF(KL$5=\"\",\"\",VLOOKUP(WEEKDAY(DATE($A$2,$A$3+$A$1-1,KL5),2),Sheet3!$D$1:$E$7,2,0))","v":""},{"$f":"IF(KM$5=\"\",\"\",VLOOKUP(WEEKDAY(DATE($A$2,$A$3+$A$1-1,KM5),2),Sheet3!$D$1:$E$7,2,0))","v":""},{"$f":"IF(KN$5=\"\",\"\",VLOOKUP(WEEKDAY(DATE($A$2,$A$3+$A$1-1,KN5),2),Sheet3!$D$1:$E$7,2,0))","v":""},{"$f":"IF(KO$5=\"\",\"\",VLOOKUP(WEEKDAY(DATE($A$2,$A$3+$A$1-1,KO5),2),Sheet3!$D$1:$E$7,2,0))","v":""},{"$f":"IF(KP$5=\"\",\"\",VLOOKUP(WEEKDAY(DATE($A$2,$A$3+$A$1-1,KP5),2),Sheet3!$D$1:$E$7,2,0))","v":""},{"$f":"IF(KQ$5=\"\",\"\",VLOOKUP(WEEKDAY(DATE($A$2,$A$3+$A$1-1,KQ5),2),Sheet3!$D$1:$E$7,2,0))","v":""},{"$f":"IF(KR$5=\"\",\"\",VLOOKUP(WEEKDAY(DATE($A$2,$A$3+$A$1-1,KR5),2),Sheet3!$D$1:$E$7,2,0))","v":""},{"$f":"IF(KS$5=\"\",\"\",VLOOKUP(WEEKDAY(DATE($A$2,$A$3+$A$1-1,KS5),2),Sheet3!$D$1:$E$7,2,0))","v":""},{"$f":"IF(KT$5=\"\",\"\",VLOOKUP(WEEKDAY(DATE($A$2,$A$3+$A$1-1,KT5),2),Sheet3!$D$1:$E$7,2,0))","v":""},{"$f":"IF(KU$5=\"\",\"\",VLOOKUP(WEEKDAY(DATE($A$2,$A$3+$A$1-1,KU5),2),Sheet3!$D$1:$E$7,2,0))","v":""},{"$f":"IF(KV$5=\"\",\"\",VLOOKUP(WEEKDAY(DATE($A$2,$A$3+$A$1-1,KV5),2),Sheet3!$D$1:$E$7,2,0))","v":""},{"$f":"IF(KW$5=\"\",\"\",VLOOKUP(WEEKDAY(DATE($A$2,$A$3+$A$1-1,KW5),2),Sheet3!$D$1:$E$7,2,0))","v":""},{"$f":"IF(KX$5=\"\",\"\",VLOOKUP(WEEKDAY(DATE($A$2,$A$3+$A$1-1,KX5),2),Sheet3!$D$1:$E$7,2,0))","v":""},{"$f":"IF(KY$5=\"\",\"\",VLOOKUP(WEEKDAY(DATE($A$2,$A$3+$A$1-1,KY5),2),Sheet3!$D$1:$E$7,2,0))","v":""},{"$f":"IF(KZ$5=\"\",\"\",VLOOKUP(WEEKDAY(DATE($A$2,$A$3+$A$1-1,KZ5),2),Sheet3!$D$1:$E$7,2,0))","v":""},{"$f":"IF(LA$5=\"\",\"\",VLOOKUP(WEEKDAY(DATE($A$2,$A$3+$A$1-1,LA5),2),Sheet3!$D$1:$E$7,2,0))","v":""},{"$f":"IF(LB$5=\"\",\"\",VLOOKUP(WEEKDAY(DATE($A$2,$A$3+$A$1-1,LB5),2),Sheet3!$D$1:$E$7,2,0))","v":""},{"$f":"IF(LC$5=\"\",\"\",VLOOKUP(WEEKDAY(DATE($A$2,$A$3+$A$1-1,LC5),2),Sheet3!$D$1:$E$7,2,0))","v":""},{"$f":"IF(LD$5=\"\",\"\",VLOOKUP(WEEKDAY(DATE($A$2,$A$3+$A$1-1,LD5),2),Sheet3!$D$1:$E$7,2,0))","v":""},{"$f":"IF(LE$5=\"\",\"\",VLOOKUP(WEEKDAY(DATE($A$2,$A$3+$A$1-1,LE5),2),Sheet3!$D$1:$E$7,2,0))","v":""},{"$f":"IF(LF$5=\"\",\"\",VLOOKUP(WEEKDAY(DATE($A$2,$A$3+$A$1-1,LF5),2),Sheet3!$D$1:$E$7,2,0))","v":""},{"$f":"IF(LG$5=\"\",\"\",VLOOKUP(WEEKDAY(DATE($A$2,$A$3+$A$1-1,LG5),2),Sheet3!$D$1:$E$7,2,0))","v":""},{"$f":"IF(LH$5=\"\",\"\",VLOOKUP(WEEKDAY(DATE($A$2,$A$3+$A$1-1,LH5),2),Sheet3!$D$1:$E$7,2,0))","v":""},{"$f":"IF(LI$5=\"\",\"\",VLOOKUP(WEEKDAY(DATE($A$2,$A$3+$A$1-1,LI5),2),Sheet3!$D$1:$E$7,2,0))","v":""},{"$f":"IF(LJ$5=\"\",\"\",VLOOKUP(WEEKDAY(DATE($A$2,$A$3+$A$1-1,LJ5),2),Sheet3!$D$1:$E$7,2,0))","v":""},{"$f":"IF(LK$5=\"\",\"\",VLOOKUP(WEEKDAY(DATE($A$2,$A$3+$A$1-1,LK5),2),Sheet3!$D$1:$E$7,2,0))","v":""},{"$f":"IF(LL$5=\"\",\"\",VLOOKUP(WEEKDAY(DATE($A$2,$A$3+$A$1-1,LL5),2),Sheet3!$D$1:$E$7,2,0))","v":""},{"$f":"IF(LM$5=\"\",\"\",VLOOKUP(WEEKDAY(DATE($A$2,$A$3+$A$1-1,LM5),2),Sheet3!$D$1:$E$7,2,0))","v":""},{"$f":"IF(LN$5=\"\",\"\",VLOOKUP(WEEKDAY(DATE($A$2,$A$3+$A$1-1,LN5),2),Sheet3!$D$1:$E$7,2,0))","v":""},{"$f":"IF(LO$5=\"\",\"\",VLOOKUP(WEEKDAY(DATE($A$2,$A$3+$A$1-1,LO5),2),Sheet3!$D$1:$E$7,2,0))","v":""},{"$f":"IF(LP$5=\"\",\"\",VLOOKUP(WEEKDAY(DATE($A$2,$A$3+$A$1-1,LP5),2),Sheet3!$D$1:$E$7,2,0))","v":""},{"$f":"IF(LQ$5=\"\",\"\",VLOOKUP(WEEKDAY(DATE($A$2,$A$3+$A$1-1,LQ5),2),Sheet3!$D$1:$E$7,2,0))","v":""},{"$f":"IF(LR$5=\"\",\"\",VLOOKUP(WEEKDAY(DATE($A$2,$A$3+$A$1-1,LR5),2),Sheet3!$D$1:$E$7,2,0))","v":""},{"$f":"IF(LS$5=\"\",\"\",VLOOKUP(WEEKDAY(DATE($A$2,$A$3+$A$1-1,LS5),2),Sheet3!$D$1:$E$7,2,0))","v":""},{"$f":"IF(LT$5=\"\",\"\",VLOOKUP(WEEKDAY(DATE($A$2,$A$3+$A$1-1,LT5),2),Sheet3!$D$1:$E$7,2,0))","v":""},{"$f":"IF(LU$5=\"\",\"\",VLOOKUP(WEEKDAY(DATE($A$2,$A$3+$A$1-1,LU5),2),Sheet3!$D$1:$E$7,2,0))","v":""},{"$f":"IF(LV$5=\"\",\"\",VLOOKUP(WEEKDAY(DATE($A$2,$A$3+$A$1-1,LV5),2),Sheet3!$D$1:$E$7,2,0))","v":""},{"$f":"IF(LW$5=\"\",\"\",VLOOKUP(WEEKDAY(DATE($A$2,$A$3+$A$1-1,LW5),2),Sheet3!$D$1:$E$7,2,0))","v":""},{"$f":"IF(LX$5=\"\",\"\",VLOOKUP(WEEKDAY(DATE($A$2,$A$3+$A$1-1,LX5),2),Sheet3!$D$1:$E$7,2,0))","v":""},{"$f":"IF(LY$5=\"\",\"\",VLOOKUP(WEEKDAY(DATE($A$2,$A$3+$A$1-1,LY5),2),Sheet3!$D$1:$E$7,2,0))","v":""},{"$f":"IF(LZ$5=\"\",\"\",VLOOKUP(WEEKDAY(DATE($A$2,$A$3+$A$1-1,LZ5),2),Sheet3!$D$1:$E$7,2,0))","v":""},{"$f":"IF(MA$5=\"\",\"\",VLOOKUP(WEEKDAY(DATE($A$2,$A$3+$A$1-1,MA5),2),Sheet3!$D$1:$E$7,2,0))","v":""},{"$f":"IF(MB$5=\"\",\"\",VLOOKUP(WEEKDAY(DATE($A$2,$A$3+$A$1-1,MB5),2),Sheet3!$D$1:$E$7,2,0))","v":""},{"$f":"IF(MC$5=\"\",\"\",VLOOKUP(WEEKDAY(DATE($A$2,$A$3+$A$1-1,MC5),2),Sheet3!$D$1:$E$7,2,0))","v":""},{"$f":"IF(MD$5=\"\",\"\",VLOOKUP(WEEKDAY(DATE($A$2,$A$3+$A$1-1,MD5),2),Sheet3!$D$1:$E$7,2,0))","v":""},{"$f":"IF(ME$5=\"\",\"\",VLOOKUP(WEEKDAY(DATE($A$2,$A$3+$A$1-1,ME5),2),Sheet3!$D$1:$E$7,2,0))","v":""},{"$f":"IF(MF$5=\"\",\"\",VLOOKUP(WEEKDAY(DATE($A$2,$A$3+$A$1-1,MF5),2),Sheet3!$D$1:$E$7,2,0))","v":""},{"$f":"IF(MG$5=\"\",\"\",VLOOKUP(WEEKDAY(DATE($A$2,$A$3+$A$1-1,MG5),2),Sheet3!$D$1:$E$7,2,0))","v":""},{"$f":"IF(MH$5=\"\",\"\",VLOOKUP(WEEKDAY(DATE($A$2,$A$3+$A$1-1,MH5),2),Sheet3!$D$1:$E$7,2,0))","v":""},{"$f":"IF(MI$5=\"\",\"\",VLOOKUP(WEEKDAY(DATE($A$2,$A$3+$A$1-1,MI5),2),Sheet3!$D$1:$E$7,2,0))","v":""},{"$f":"IF(MJ$5=\"\",\"\",VLOOKUP(WEEKDAY(DATE($A$2,$A$3+$A$1-1,MJ5),2),Sheet3!$D$1:$E$7,2,0))","v":""},{"$f":"IF(MK$5=\"\",\"\",VLOOKUP(WEEKDAY(DATE($A$2,$A$3+$A$1-1,MK5),2),Sheet3!$D$1:$E$7,2,0))","v":""},{"$f":"IF(ML$5=\"\",\"\",VLOOKUP(WEEKDAY(DATE($A$2,$A$3+$A$1-1,ML5),2),Sheet3!$D$1:$E$7,2,0))","v":""},{"$f":"IF(MM$5=\"\",\"\",VLOOKUP(WEEKDAY(DATE($A$2,$A$3+$A$1-1,MM5),2),Sheet3!$D$1:$E$7,2,0))","v":""},{"$f":"IF(MN$5=\"\",\"\",VLOOKUP(WEEKDAY(DATE($A$2,$A$3+$A$1-1,MN5),2),Sheet3!$D$1:$E$7,2,0))","v":""},{"$f":"IF(MO$5=\"\",\"\",VLOOKUP(WEEKDAY(DATE($A$2,$A$3+$A$1-1,MO5),2),Sheet3!$D$1:$E$7,2,0))","v":""},{"$f":"IF(MP$5=\"\",\"\",VLOOKUP(WEEKDAY(DATE($A$2,$A$3+$A$1-1,MP5),2),Sheet3!$D$1:$E$7,2,0))","v":""},{"$f":"IF(MQ$5=\"\",\"\",VLOOKUP(WEEKDAY(DATE($A$2,$A$3+$A$1-1,MQ5),2),Sheet3!$D$1:$E$7,2,0))","v":""},{"$f":"IF(MR$5=\"\",\"\",VLOOKUP(WEEKDAY(DATE($A$2,$A$3+$A$1-1,MR5),2),Sheet3!$D$1:$E$7,2,0))","v":""},{"$f":"IF(MS$5=\"\",\"\",VLOOKUP(WEEKDAY(DATE($A$2,$A$3+$A$1-1,MS5),2),Sheet3!$D$1:$E$7,2,0))","v":""},{"$f":"IF(MT$5=\"\",\"\",VLOOKUP(WEEKDAY(DATE($A$2,$A$3+$A$1-1,MT5),2),Sheet3!$D$1:$E$7,2,0))","v":""},{"$f":"IF(MU$5=\"\",\"\",VLOOKUP(WEEKDAY(DATE($A$2,$A$3+$A$1-1,MU5),2),Sheet3!$D$1:$E$7,2,0))","v":""},{"$f":"IF(MV$5=\"\",\"\",VLOOKUP(WEEKDAY(DATE($A$2,$A$3+$A$1-1,MV5),2),Sheet3!$D$1:$E$7,2,0))","v":""},{"$f":"IF(MW$5=\"\",\"\",VLOOKUP(WEEKDAY(DATE($A$2,$A$3+$A$1-1,MW5),2),Sheet3!$D$1:$E$7,2,0))","v":""},{"$f":"IF(MX$5=\"\",\"\",VLOOKUP(WEEKDAY(DATE($A$2,$A$3+$A$1-1,MX5),2),Sheet3!$D$1:$E$7,2,0))","v":""},{"$f":"IF(MY$5=\"\",\"\",VLOOKUP(WEEKDAY(DATE($A$2,$A$3+$A$1-1,MY5),2),Sheet3!$D$1:$E$7,2,0))","v":""},{"$f":"IF(MZ$5=\"\",\"\",VLOOKUP(WEEKDAY(DATE($A$2,$A$3+$A$1-1,MZ5),2),Sheet3!$D$1:$E$7,2,0))","v":""},{"$f":"IF(NA$5=\"\",\"\",VLOOKUP(WEEKDAY(DATE($A$2,$A$3+$A$1-1,NA5),2),Sheet3!$D$1:$E$7,2,0))","v":""},{"$f":"IF(NB$5=\"\",\"\",VLOOKUP(WEEKDAY(DATE($A$2,$A$3+$A$1-1,NB5),2),Sheet3!$D$1:$E$7,2,0))","v":""},{"$f":"IF(NC$5=\"\",\"\",VLOOKUP(WEEKDAY(DATE($A$2,$A$3+$A$1-1,NC5),2),Sheet3!$D$1:$E$7,2,0))","v":""},{"$f":"IF(ND$5=\"\",\"\",VLOOKUP(WEEKDAY(DATE($A$2,$A$3+$A$1-1,ND5),2),Sheet3!$D$1:$E$7,2,0))","v":""},{"$f":"IF(NE$5=\"\",\"\",VLOOKUP(WEEKDAY(DATE($A$2,$A$3+$A$1-1,NE5),2),Sheet3!$D$1:$E$7,2,0))","v":""},{"$f":"IF(NF$5=\"\",\"\",VLOOKUP(WEEKDAY(DATE($A$2,$A$3+$A$1-1,NF5),2),Sheet3!$D$1:$E$7,2,0))","v":""},{"$f":"IF(NG$5=\"\",\"\",VLOOKUP(WEEKDAY(DATE($A$2,$A$3+$A$1-1,NG5),2),Sheet3!$D$1:$E$7,2,0))","v":""},{"$f":"IF(NH$5=\"\",\"\",VLOOKUP(WEEKDAY(DATE($A$2,$A$3+$A$1-1,NH5),2),Sheet3!$D$1:$E$7,2,0))","v":""},{"$f":"IF(NI$5=\"\",\"\",VLOOKUP(WEEKDAY(DATE($A$2,$A$3+$A$1-1,NI5),2),Sheet3!$D$1:$E$7,2,0))","v":""},{"$nulls":8},"Half Day","H"]
["Week #",{"$f":"IF(B$5=\"\",\"\",WEEKNUM(DATE($A$2,VLOOKUP($A$1,Sheet3!$A$1:$B$12,2,0),COLUMNS($A$6:A6)),2))","v":{"$error":"#N/A"}},{"$f":"IF(C$5=\"\",\"\",WEEKNUM(DATE($A$2,VLOOKUP($A$1,Sheet3!$A$1:$B$12,2,0),COLUMNS($A$6:B6)),2))","v":{"$error":"#N/A"}},{"$f":"IF(D$5=\"\",\"\",WEEKNUM(DATE($A$2,VLOOKUP($A$1,Sheet3!$A$1:$B$12,2,0),COLUMNS($A$6:C6)),2))","v":{"$error":"#N/A"}},{"$f":"IF(E$5=\"\",\"\",WEEKNUM(DATE($A$2,VLOOKUP($A$1,Sheet3!$A$1:$B$12,2,0),COLUMNS($A$6:D6)),2))","v":{"$error":"#N/A"}},{"$f":"IF(F$5=\"\",\"\",WEEKNUM(DATE($A$2,VLOOKUP($A$1,Sheet3!$A$1:$B$12,2,0),COLUMNS($A$6:E6)),2))","v":{"$error":"#N/A"}},{"$f":"IF(G$5=\"\",\"\",WEEKNUM(DATE($A$2,VLOOKUP($A$1,Sheet3!$A$1:$B$12,2,0),COLUMNS($A$6:F6)),2))","v":{"$error":"#N/A"}},{"$f":"IF(H$5=\"\",\"\",WEEKNUM(DATE($A$2,VLOOKUP($A$1,Sheet3!$A$1:$B$12,2,0),COLUMNS($A$6:G6)),2))","v":{"$error":"#N/A"}},{"$f":"IF(I$5=\"\",\"\",WEEKNUM(DATE($A$2,VLOOKUP($A$1,Sheet3!$A$1:$B$12,2,0),COLUMNS($A$6:H6)),2))","v":{"$error":"#N/A"}},{"$f":"IF(J$5=\"\",\"\",WEEKNUM(DATE($A$2,VLOOKUP($A$1,Sheet3!$A$1:$B$12,2,0),COLUMNS($A$6:I6)),2))","v":{"$error":"#N/A"}},{"$f":"IF(K$5=\"\",\"\",WEEKNUM(DATE($A$2,VLOOKUP($A$1,Sheet3!$A$1:$B$12,2,0),COLUMNS($A$6:J6)),2))","v":{"$error":"#N/A"}},{"$f":"IF(L$5=\"\",\"\",WEEKNUM(DATE($A$2,VLOOKUP($A$1,Sheet3!$A$1:$B$12,2,0),COLUMNS($A$6:K6)),2))","v":{"$error":"#N/A"}},{"$f":"IF(M$5=\"\",\"\",WEEKNUM(DATE($A$2,VLOOKUP($A$1,Sheet3!$A$1:$B$12,2,0),COLUMNS($A$6:L6)),2))","v":{"$error":"#N/A"}},{"$f":"IF(N$5=\"\",\"\",WEEKNUM(DATE($A$2,VLOOKUP($A$1,Sheet3!$A$1:$B$12,2,0),COLUMNS($A$6:M6)),2))","v":{"$error":"#N/A"}},{"$f":"IF(O$5=\"\",\"\",WEEKNUM(DATE($A$2,VLOOKUP($A$1,Sheet3!$A$1:$B$12,2,0),COLUMNS($A$6:N6)),2))","v":{"$error":"#N/A"}},{"$f":"IF(P$5=\"\",\"\",WEEKNUM(DATE($A$2,VLOOKUP($A$1,Sheet3!$A$1:$B$12,2,0),COLUMNS($A$6:O6)),2))","v":{"$error":"#N/A"}},{"$f":"IF(Q$5=\"\",\"\",WEEKNUM(DATE($A$2,VLOOKUP($A$1,Sheet3!$A$1:$B$12,2,0),COLUMNS($A$6:P6)),2))","v":{"$error":"#N/A"}},{"$f":"IF(R$5=\"\",\"\",WEEKNUM(DATE($A$2,VLOOKUP($A$1,Sheet3!$A$1:$B$12,2,0),COLUMNS($A$6:Q6)),2))","v":{"$error":"#N/A"}},{"$f":"IF(S$5=\"\",\"\",WEEKNUM(DATE($A$2,VLOOKUP($A$1,Sheet3!$A$1:$B$12,2,0),COLUMNS($A$6:R6)),2))","v":{"$error":"#N/A"}},{"$f":"IF(T$5=\"\",\"\",WEEKNUM(DATE($A$2,VLOOKUP($A$1,Sheet3!$A$1:$B$12,2,0),COLUMNS($A$6:S6)),2))","v":{"$error":"#N/A"}},{"$f":"IF(U$5=\"\",\"\",WEEKNUM(DATE($A$2,VLOOKUP($A$1,Sheet3!$A$1:$B$12,2,0),COLUMNS($A$6:T6)),2))","v":{"$error":"#N/A"}},{"$f":"IF(V$5=\"\",\"\",WEEKNUM(DATE($A$2,VLOOKUP($A$1,Sheet3!$A$1:$B$12,2,0),COLUMNS($A$6:U6)),2))","v":{"$error":"#N/A"}},{"$f":"IF(W$5=\"\",\"\",WEEKNUM(DATE($A$2,VLOOKUP($A$1,Sheet3!$A$1:$B$12,2,0),COLUMNS($A$6:V6)),2))","v":{"$error":"#N/A"}},{"$f":"IF(X$5=\"\",\"\",WEEKNUM(DATE($A$2,VLOOKUP($A$1,Sheet3!$A$1:$B$12,2,0),COLUMNS($A$6:W6)),2))","v":{"$error":"#N/A"}},{"$f":"IF(Y$5=\"\",\"\",WEEKNUM(DATE($A$2,VLOOKUP($A$1,Sheet3!$A$1:$B$12,2,0),COLUMNS($A$6:X6)),2))","v":{"$error":"#N/A"}},{"$f":"IF(Z$5=\"\",\"\",WEEKNUM(DATE($A$2,VLOOKUP($A$1,Sheet3!$A$1:$B$12,2,0),COLUMNS($A$6:Y6)),2))","v":{"$error":"#N/A"}},{"$f":"IF(AA$5=\"\",\"\",WEEKNUM(DATE($A$2,VLOOKUP($A$1,Sheet3!$A$1:$B$12,2,0),COLUMNS($A$6:Z6)),2))","v":{"$error":"#N/A"}},{"$f":"IF(AB$5=\"\",\"\",WEEKNUM(DATE($A$2,VLOOKUP($A$1,Sheet3!$A$1:$B$12,2,0),COLUMNS($A$6:AA6)),2))","v":{"$error":"#N/A"}},{"$f":"IF(AC$5=\"\",\"\",WEEKNUM(DATE($A$2,VLOOKUP($A$1,Sheet3!$A$1:$B$12,2,0),COLUMNS($A$6:AB6)),2))","v":{"$error":"#N/A"}},{"$f":"IF(AD$5=\"\",\"\",WEEKNUM(DATE($A$2,VLOOKUP($A$1,Sheet3!$A$1:$B$12,2,0),COLUMNS($A$6:AC6)),2))","v":{"$error":"#N/A"}},{"$f":"IF(AE$5=\"\",\"\",WEEKNUM(DATE($A$2,VLOOKUP($A$1,Sheet3!$A$1:$B$12,2,0),COLUMNS($A$6:AD6)),2))","v":{"$error":"#N/A"}},{"$f":"IF(AF$5=\"\",\"\",WEEKNUM(DATE($A$2,VLOOKUP($A$1,Sheet3!$A$1:$B$12,2,0),COLUMNS($A$6:AE6)),2))","v":{"$error":"#N/A"}}]
["Employee 1",{"$nulls":372},{"$f":"SUMPRODUCT((OFFSET($A8,0,31*($A$3-1)+1,1,31)<>\"\")*(IF(OFFSET($A8,0,31*($A$3-1)+1,1,31)=$NS$6,0.5,1)*(OFFSET($A$4,0,31*($A$3-1)+1,1,31))))","v":0},{"$f":"SUMPRODUCT((OFFSET($A8,0,1,1,372)<>\"\")*(IF(OFFSET($A8,0,1,1,372)=$NS$6,0.5,1)*(OFFSET($A$3,0,1,1,372))))","v":0},{"$f":"SUMPRODUCT((OFFSET($A8,0,1,1,372)<>\"\")*(OFFSET($A$3,0,1,1,372))*((OFFSET($A8,0,1,1,372))=NL$5))","v":0},{"$f":"SUMPRODUCT((OFFSET($A8,0,1,1,372)<>\"\")*(OFFSET($A$3,0,1,1,372))*((OFFSET($A8,0,1,1,372))=NM$5))","v":0},{"$f":"SUMPRODUCT((OFFSET($A8,0,1,1,372)<>\"\")*(OFFSET($A$3,0,1,1,372))*((OFFSET($A8,0,1,1,372))=NN$5))","v":0},{"$f":"SUMPRODUCT((OFFSET($A8,0,1,1,372)<>\"\")*(OFFSET($A$3,0,1,1,372))*((OFFSET($A8,0,1,1,372))=NO$5))","v":0},{"$f":"SUMPRODUCT((OFFSET($A8,0,1,1,372)<>\"\")*(OFFSET($A$3,0,1,1,372))*((OFFSET($A8,0,1,1,372))=NP$5))","v":0}]
["Employee 2",{"$nulls":372},{"$f":"SUMPRODUCT((OFFSET($A9,0,31*($A$3-1)+1,1,31)<>\"\")*(IF(OFFSET($A9,0,31*($A$3-1)+1,1,31)=$NS$6,0.5,1)*(OFFSET($A$4,0,31*($A$3-1)+1,1,31))))","v":0},{"$f":"SUMPRODUCT((OFFSET($A9,0,1,1,372)<>\"\")*(IF(OFFSET($A9,0,1,1,372)=$NS$6,0.5,1)*(OFFSET($A$3,0,1,1,372))))","v":0},{"$f":"SUMPRODUCT((OFFSET($A9,0,1,1,372)<>\"\")*(OFFSET($A$3,0,1,1,372))*((OFFSET($A9,0,1,1,372))=NL$5))","v":0},0,{"$f":"SUMPRODUCT((OFFSET($A9,0,1,1,372)<>\"\")*(OFFSET($A$3,0,1,1,372))*((OFFSET($A9,0,1,1,372))=NN$5))","v":0},0,0]
["Employee 3",{"$nulls":372},{"$f":"SUMPRODUCT((OFFSET($A10,0,31*($A$3-1)+1,1,31)<>\"\")*(IF(OFFSET($A10,0,31*($A$3-1)+1,1,31)=$NS$6,0.5,1)*(OFFSET($A$4,0,31*($A$3-1)+1,1,31))))","v":0},{"$f":"SUMPRODUCT((OFFSET($A10,0,1,1,372)<>\"\")*(IF(OFFSET($A10,0,1,1,372)=$NS$6,0.5,1)*(OFFSET($A$3,0,1,1,372))))","v":0},0,0,0,0,0,null,"Select Working Days"]
["Employee 4",{"$nulls":372},{"$f":"SUMPRODUCT((OFFSET($A11,0,31*($A$3-1)+1,1,31)<>\"\")*(IF(OFFSET($A11,0,31*($A$3-1)+1,1,31)=$NS$6,0.5,1)*(OFFSET($A$4,0,31*($A$3-1)+1,1,31))))","v":0},{"$f":"SUMPRODUCT((OFFSET($A11,0,1,1,372)<>\"\")*(IF(OFFSET($A11,0,1,1,372)=$NS$6,0.5,1)*(OFFSET($A$3,0,1,1,372))))","v":0},0,0,0,0,0,null,"Mon","Yes"]
["Employee 5",{"$nulls":372},{"$f":"SUMPRODUCT((OFFSET($A12,0,31*($A$3-1)+1,1,31)<>\"\")*(IF(OFFSET($A12,0,31*($A$3-1)+1,1,31)=$NS$6,0.5,1)*(OFFSET($A$4,0,31*($A$3-1)+1,1,31))))","v":0},{"$f":"SUMPRODUCT((OFFSET($A12,0,1,1,372)<>\"\")*(IF(OFFSET($A12,0,1,1,372)=$NS$6,0.5,1)*(OFFSET($A$3,0,1,1,372))))","v":0},0,0,0,0,0,null,"Tue","Yes"]
["Employee 6",{"$nulls":372},{"$f":"SUMPRODUCT((OFFSET($A13,0,31*($A$3-1)+1,1,31)<>\"\")*(IF(OFFSET($A13,0,31*($A$3-1)+1,1,31)=$NS$6,0.5,1)*(OFFSET($A$4,0,31*($A$3-1)+1,1,31))))","v":0},{"$f":"SUMPRODUCT((OFFSET($A13,0,1,1,372)<>\"\")*(IF(OFFSET($A13,0,1,1,372)=$NS$6,0.5,1)*(OFFSET($A$3,0,1,1,372))))","v":0},0,0,0,0,0,null,"Wed","Yes"]
["Employee 7",{"$nulls":372},{"$f":"SUMPRODUCT((OFFSET($A14,0,31*($A$3-1)+1,1,31)<>\"\")*(IF(OFFSET($A14,0,31*($A$3-1)+1,1,31)=$NS$6,0.5,1)*(OFFSET($A$4,0,31*($A$3-1)+1,1,31))))","v":0},{"$f":"SUMPRODUCT((OFFSET($A14,0,1,1,372)<>\"\")*(IF(OFFSET($A14,0,1,1,372)=$NS$6,0.5,1)*(OFFSET($A$3,0,1,1,372))))","v":0},0,0,0,0,0,null,"Thu","Yes"]
["Employee 8",{"$nulls":372},{"$f":"SUMPRODUCT((OFFSET($A15,0,31*($A$3-1)+1,1,31)<>\"\")*(IF(OFFSET($A15,0,31*($A$3-1)+1,1,31)=$NS$6,0.5,1)*(OFFSET($A$4,0,31*($A$3-1)+1,1,31))))","v":0},{"$f":"SUMPRODUCT((OFFSET($A15,0,1,1,372)<>\"\")*(IF(OFFSET($A15,0,1,1,372)=$NS$6,0.5,1)*(OFFSET($A$3,0,1,1,372))))","v":0},0,0,0,0,0,null,"Fri","Yes"]
["Employee 9",{"$nulls":372},{"$f":"SUMPRODUCT((OFFSET($A16,0,31*($A$3-1)+1,1,31)<>\"\")*(IF(OFFSET($A16,0,31*($A$3-1)+1,1,31)=$NS$6,0.5,1)*(OFFSET($A$4,0,31*($A$3-1)+1,1,31))))","v":0},{"$f":"SUMPRODUCT((OFFSET($A16,0,1,1,372)<>\"\")*(IF(OFFSET($A16,0,1,1,372)=$NS$6,0.5,1)*(OFFSET($A$3,0,1,1,372))))","v":0},0,0,0,0,0,null,"Sat","No"]
["Employee 10",{"$nulls":372},{"$f":"SUMPRODUCT((OFFSET($A17,0,31*($A$3-1)+1,1,31)<>\"\")*(IF(OFFSET($A17,0,31*($A$3-1)+1,1,31)=$NS$6,0.5,1)*(OFFSET($A$4,0,31*($A$3-1)+1,1,31))))","v":0},{"$f":"SUMPRODUCT((OFFSET($A17,0,1,1,372)<>\"\")*(IF(OFFSET($A17,0,1,1,372)=$NS$6,0.5,1)*(OFFSET($A$3,0,1,1,372))))","v":0},0,0,0,0,0,null,"Sun","No"]
[]
[]
[{"$nulls":381},"Want More Free Excel Templates - Click Here"]

{"sheet":"Holidays","index":1,"n_rows":12,"n_cols":2,"rows_kept":12,"cut":false,"hidden":false,"merged":[]}
["Holiday","Date"]
["New Year Day","2017-01-01"]
["Martin Luther King Junior Day","2017-01-16"]
["President's Day","2017-02-20"]
["Easter","2017-04-16"]
["Memorial Day","2017-05-29"]
["Independence Day","2017-07-04"]
["Labor Day","2017-09-05"]
["Columbus Day","2017-10-09"]
["Veterans Day","2017-11-11"]
["Thanksgiving Day","2017-11-23"]
["Christmas Day","2017-12-25"]

{"sheet":"Sheet3","index":2,"n_rows":12,"n_cols":7,"rows_kept":12,"cut":false,"hidden":true,"merged":[]}
["January",1,null,1,"Mon",null,{"$f":"INDEX($A$1:$A$12,MATCH('Leave Tracker'!$A$1+'Leave Tracker'!$A$3-1,Sheet3!$B$1:$B$12,0))&\" \"&'Leave Tracker'!$A$2","v":"January 2017"}]
["February",2,null,2,"Tue",null,{"$f":"INDEX($A$1:$A$12,MATCH(MONTH(DATE('Leave Tracker'!$A$2,'Leave Tracker'!$A$1+'Leave Tracker'!$A$3-1,1)),$B$1:$B$12,0))&\" \"&YEAR(DATE('Leave Tracker'!$A$2,'Leave Tracker'!$A$1+'Leave Tracker'!$A$3-1,1))","v":"January 2017"}]
["March",3,null,3,"Wed"]
["April",4,null,4,"Thu"]
["May",5,null,5,"Fri"]
["June",6,null,6,"Sat"]
["July",7,null,7,"Sun"]
["August",8]
["September",9]
["October",10]
["November",11]
["December",12]